{"text_format":"1","workbook":"xlsx","n_sheets":7,"sheets":["FMIS and OBD","Stats","Good Practice cases","Economy","Points","INET Codes","Metadata"],"not_rendered":{"charts":20,"images":198,"macros":1,"external_links":0,"defined_names":26,"comments":3,"pivot_tables":0},"unopened":[],"bounds":{"document_bytes":16777216,"sheet_cells":100000,"rows_first":2000,"rows_last":500,"rows_between":2000,"halvings":0,"cell_chars":16384,"cell_head_chars":4096},"cells_cut":0,"cells_raw":0,"read":"whole","date_system":"1900"}

{"sheet":"FMIS and OBD","index":0,"n_rows":224,"n_cols":148,"rows_kept":224,"cut":false,"hidden":false,"merged":[[0,104,0,105],[0,110,0,114],[0,106,0,109],[0,11,0,12],[0,69,0,70],[0,73,0,75],[0,29,0,32],[0,67,0,68],[0,13,0,19],[0,20,0,23],[0,55,0,56],[0,57,0,58],[0,59,0,60],[0,120,0,130],[0,0,0,6],[0,132,0,134],[0,81,0,91],[0,33,0,35],[0,36,0,39],[0,40,0,42],[0,43,0,54],[0,24,0,25],[0,71,0,72],[0,76,0,80],[0,26,0,28],[0,92,0,103],[0,7,0,10],[0,116,0,119],[0,61,0,66]]}
["FMIS & OBD data set (Jun 2013)",null,null,null,null,null,null,"Q1 > Does the Finance Ministry/Dept have a web site or portal dedicated to publish Public Finance (PF) information?",null,null,null,"Q2 > Is there a web site / doc on FMIS solution?",null,"Q3 > What is the source of information\nfor publishing PF information? ",null,null,null,null,null,null,"Q4 > Is the PF information meaningful to citizens or budget entities?",null,null,null,"Q5 > Is the data str/list of BC/CoA published?",null,"Q6 > Annual budget plans",null,null,"Q7 > Medium-Term Expenditure Framework",null,null,null,"Q8 > Investment plans",null,null,"Q9 > Budget execution results",null,null,null,"Q10 > External audit of budget",null,null,"Q11 > What is the level of detail of the public expenditure / revenue information published online",null,null,null,null,null,null,null,null,null,null,null,"Q12 > Is there an Open Gov/Data web site?",null,"Q13 > FMIS support for Sub-Natl Gov (SNG)",null,"Q14 > Harmonized acct for all levels (incl SNG)",null,"Q15 > Are there other government web sites \nreporing budget results/performance?",null,null,null,null,null,"Q16 > Is there a web site on Access to Info / Std?",null,"Q17 > PFM regulations published?",null,"Q18 > Compliance with intl reporting std?",null,"Q19 > Are there a feedback / monitoring options?",null,null,"Q20 > What languages are used to publish PF data?",null,null,null,null,"FMIS solutions",null,null,null,null,null,null,null,null,null,null,"PEFA Performance Indicators",null,null,null,null,null,null,null,null,null,null,null,"PEFA Averages",null,"Other indicators",null,null,null,"UN e-Gov 2012 Indices",null,null,null,null,"Region","Other Categories",null,null,null,"Open Source Policies adopted by the governments (2010)",null,null,null,null,null,null,null,null,null,null,"Verified by Gov officials","Results: FMIS & OBD\nPractice Groups"]
["#","Flag","Economy","Level","Population","GNI","GNIPC","Q1.1  MoF URL","Q1.2  Org Name","Q1.3","Q1.4  PF Data URL","Q2.1","Q2.2 FMIS URL","Q3.1","Q3.2  Dynamic Q","Q3.3","Q3.4  Open Data","Q3.5","Q3.6","Q3.7  Reliability","Q4.1","Q4.2","Q4.3","Q4.4  Ctz Budget","Q5.1","Q5.2  BC/CoA","Q6.1","Q6.2","Q6.3","Q7.1","Q7.2","Q7.3","Q7.4","Q8.1","Q8.2","Q8.3","Q9.1","Q9.2","Q9.3","Q9.4","Q10.1","Q10.2","Q10.3","Q11.1","Q11.2","Q11.3","Q11.4","Q11.5","Q11.6","Q11.7","Q11.8","Q11.9","Q11.10","Q11.11","Q11.12  Other","Q12.1","Q12.2  Open Gov/Open Data","Q13.1","Q13.2  FMIS SNG","Q14.1","Q14.2  Acct SNG","Q15.1","Q15.2  Stats URL","Q15.3  Stats Org","Q15.4  CB URL","Q15.5  Cent Bank","Q15.6  Other URL","Q16.1","Q16.2  ATI","Q17.1","Q17.2  PFM Reg","Q18.1","Q18.2  Other Rep","Q19.1","Q19.2","Q19.3  Feedback","Q20.1","Q20.2","Q20.3","Q20.4","Q20.5","FMIS / TS","FMIS","Tpl","Func","Status","Op Yr","Scope","Type","ASW","ASW Solution","Arch","PEFA Yr","Stat","PI-5","PI-6","PI-10","PI-12","PI-22","PI-23","PI-24","PI-25","PI-26","D-2","Avg10","Avg","OBI_12","OBI_10","OGP","MTEF","eGov12","eGov","eOS","eTC","eHC","Region","Zone","OECD","APEC","Fragile","Economies","OSS Gov","R","A","P","M","OSS Loc","R","A","P","M","Verif date","Tot Pts","Score","Group",null,"#","Economy","Code","Year","Pov (%p)","YearN","PovN (%p)","People","PeopleN","A","AMP","DAD"]
[1,null,"Afghanistan","LIC",35320.445,16589.620328129084,470,"http://www.mof.gov.af","Afghanistan Ministry of Finance",2,"http://www.budgetmof.gov.af",2,"http://mof.gov.af/en/page/1149",1,"-",1,"http://www.budgetmof.gov.af/index.php?option=com_content&view=article&id=49&Itemid=76&lang=en",0,0,"http://www.budgetmof.gov.af/index.php?option=com_content&view=article&id=49&Itemid=76&lang=en",1,1,1,"http://www.budgetmof.gov.af/index.php?option=com_content&view=article&id=86&Itemid=126&lang=en",1,"http://www.budgetmof.gov.af/index.php?option=com_content&view=article&id=107&Itemid=99&lang=en",1,1,2005,1,0,3,2010,0,null,"-",1,2,1,2005,0,null,"-",1,1,1,0,0,1,1,0,1,1,0,"-",0,"-",1,"http://www.budgetmof.gov.af/index.php?option=com_content&view=article&id=126%3A-what-is-the-afghanistan-financial-management-information-system-afmis&catid=58%3Aict-issues&Itemid=44&lang=en",1,"http://www.budgetmof.gov.af/index.php?option=com_content&view=article&id=107&Itemid=99&lang=en",3,"http://www.cso.gov.af","Central Statistics Office ","http://www.centralbank.gov.af","Bank of Afghanistan ","http://www.treasury.gov.af",0,"-",1,"http://www.treasury.gov.af/index_files/Page1081.htm",2,"National laws and regulations",1,3,"-","per","eng","-","-",0,"AFMIS","Afghanistan Financial Management Information System","C","T",3,2011,"C+L",4,2,"FreeBalance","CS","Jun 2008","Public","C","B","B","B","B","D","C+","B+","C","D",2.4,2.370967741935484,59,21,null,1,184,0.1701,0.23530000000000001,5.7299999999999997E-2,0.21779999999999999,"SAR",null,null,null,"F",{"$f":"C3","v":"Afghanistan"},{"$f":"SUM(DS3:DV3)","v":0},null,null,null,null,{"$f":"SUM(DX3:EA3)","v":0},null,null,null,null,null,{"$f":"J3+L3+N3+P3+R3+S3+U3+V3+W3+Y3+AA3+AB3+AD3+AE3+AH3+AI3+AK3+AM3+AO3+AP3","v":15},{"$f":"EC3/26*100","v":57.692307692307686},{"$f":"IF(ED3<25,\"D\",IF(ED3<50,\"C\",IF(ED3<75,\"B\",\"A\")))","v":"B"},null,1,"Afghanistan","AFG",null,null,2008,36,null,12715.360200000001,null,null,"DAD"]
[2,null,"Albania","LMIC",3215.9879999999998,12787.50498816531,3980,"http://www.minfin.gov.al","Ministry of Finance of the Republic of Albania",2,"http://www.minfin.gov.al/minfin/Buxheti_1265_1.php",1,"http://www.minfin.gov.al/minfin/Sistemi_AMoFTS_1377_1.php",1,"-",1,"http://www.minfin.gov.al/minfin/Buxheti_2012_1821_1.php",0,0,"http://www.minfin.gov.al/minfin/Sistemi_AMoFTS_1377_1.php",1,1,0,"-",1,"http://www.minfin.gov.al/minfin/Thesari_1269_1.php",1,1,2003,1,1,3,2002,0,null,"-",1,2,1,2002,1,1,2009,1,1,1,0,0,1,1,1,1,1,0,"-",1,"http://open.data.al/",0,"-",1,"http://www.minfin.gov.al/minfin/GFS_ne_Vite_1597_1.php",1,"http://www.instat.gov.al","Institute of Statistics","http://www.bankofalbania.org","Bank of Albania","-",1,"http://www.minfin.gov.al/minfin/Kushtet_e_perdorimit_156_1.php",1,"http://www.minfin.gov.al/minfin/Legjislacioni_5_1.php",2,"National budget rules",1,3,"Social media tools: Facebook, Twitter, Youtube","alb","eng","-","-",0,"AMoFTS","Albania Ministry of Finance Treasury System","C","T",1,2010,"C+L",1,2,"Oracle","Web","Jan 2012","Public","A","B","B","C+","A","C","C+","A","C+","D+",2.9,2.9482758620689653,47,33,1,2,86,0.5161,0.42480000000000001,0.33700000000000002,0.7863,"ECA",null,null,null,null,{"$f":"C4","v":"Albania"},{"$f":"SUM(DS4:DV4)","v":0},null,null,null,null,{"$f":"SUM(DX4:EA4)","v":0},null,null,null,null,"2013-05-02",16,{"$f":"EC4/26*100","v":61.53846153846154},{"$f":"IF(ED4<25,\"D\",IF(ED4<50,\"C\",IF(ED4<75,\"B\",\"A\")))","v":"B"},null,2,"Albania","ALB",2008,"<2",2008,12.4,20,398.782512]
[3,null,"Algeria","UMIC",35980.192999999999,160814.05416484192,4470,"http://www.mf.gov.dz","Ministère des Finances",1,"http://www.mf.gov.dz/rubriques/58/Publications-et-Rapports.html",1,"http://www-wds.worldbank.org/external/default/WDSContentServer/WDSP/IB/2010/01/13/000334955_20100113020615/Rendered/PDF/ICR113000P06491C0disclosed011111101.pdf",1,"-",0,"-",1,0,"http://www.mf.gov.dz/article_pdf/upl-afdca3db442ba9b939e38a972bfba213.pdf",1,1,0,"-",0,"-",1,1,2001,0,null,"-","-",0,null,"-",1,4,0,2009,0,null,"-",1,1,0,0,0,0,0,0,0,0,0,"-",0,"-",0,"-",0,"-",0,"http://www.ons.dz","National Office of Statistiques","http://www.bank-of-algeria.dz ","Bank of Algeria","-",0,"-",0,"-",2,null,0,3,"-","fre","ara","-","-",0,"IBMIS","Integrated Budget Management Information System","C","F",3,2010,"C",5,1,"LDSW > Oracle?","Web","Jul 2010","Final","X","X","X","X","X","X","X","X","X","X",2.3333333333333335,2.6153846153846154,13,1,null,2,132,0.36080000000000001,0.25490000000000002,0.1812,0.64629999999999999,"MNA",null,null,null,null,"Algeria",0,null,null,null,null,0,null,null,null,null,null,9,34.615384615384613,"C",null,3,"Algeria","DZA",1995,6.8,null,null,2446.6531239999999]
[4,null,"Andorra","HIC",86.165000000000006,3712,43080.136946556027,"http://www.finances.ad","Ministeri de Finances, Andorra",2,"http://www.finances.ad/index.php?option=com_content&view=article&id=25&Itemid=33",1,"http://www.finances.ad/index.php?option=com_content&view=article&id=19&Itemid=26",1,"-",0,"-",0,0,"-",1,1,1,"http://www.tramits.ad/index.php?option=com_content&view=category&id=42&Itemid=69",1,"http://www.finances.ad/images/Pressupostos/Pressupost_2008/00-Index/Indgral.htm",1,0,2008,0,null,"-","-",0,null,"-",1,4,0,2007,0,null,"-",1,1,0,0,0,1,1,0,1,1,0,"-",0,"-",0,"-",0,"-",0,"http://www.estadistica.ad","Department of Studies and Statistics","http://www.inaf.ad","Institut Nacional Andorrà de Finances","-",1,"http://www.finances.ad/index.php?option=com_content&view=article&id=1&Itemid=2",1,"http://www.finances.ad/index.php?option=com_content&view=article&id=16&Itemid=22",0,"National laws and regulations",0,3,"-","cat","-","-","-","-","FMIS","Financial Management Information System","C","F",1,2005,"C",1,1,"LDSW","Web","-","-","-","-","-","-","-","-","-","-","-","-","-","-","-","-",null,"-",58,0.61719999999999997,0.31369999999999998,0.73150000000000004,0.80630000000000002,null,"EUR",null,null,null,"Andorra",0,null,null,null,null,0,null,null,null,null,null,10,38.461538461538467,"C",null,4,"Andorra","AND"]
[5,null,"Angola","LMIC",19618.432000000001,75216.450947877951,3830,"http://www.minfin.gv.ao","Ministério das Finanças",2,"http://www.minfin.gv.ao/docs/dspPublications.htm",1,"http://www-wds.worldbank.org/external/default/WDSContentServer/WDSP/IB/2005/03/10/000090341_20050310101310/Rendered/PDF/290360AO.pdf",1,"-",0,"-",1,1,"http://www.minfin.gv.ao/docs/dspRelExecOGE.htm",1,1,0,"-",1,"http://www.minfin.gv.ao/docs/dspPlanContEstd.htm",1,0,2006,0,null,"-","-",1,0,2008,1,4,0,2006,0,null,"-",1,1,1,0,0,1,1,1,1,0,0,"-",0,"-",0,"-",1,"http://www.minfin.gv.ao/docs/dspPlanContEstd.htm",0,"http://www.ine-ao.com","Instituto Nacional de Estatistica (Angola)","http://www.bna.ao","National Bank of Angola","-",0,"-",1,"http://www.minfin.gv.ao/docs/dspGenLeg.htm",0,"-",0,3,"-","por","-","-","-","-","SIGFE","Sistema Integrado de Gestiio das  Finanqas do Estado","C","T",3,2004,"C",1,1,"LDSW > Oracle","Web","-","-","-","-","-","-","-","-","-","-","-","-","-","-",28,26,null,0,142,0.32029999999999997,0.33329999999999999,8.9200000000000002E-2,0.5383,"AFR",null,null,null,"F","Angola",0,null,null,null,null,0,null,null,null,null,null,12,46.153846153846153,"C",null,5,"Angola","AGO",2000,54.3,2000,62.3,10652.808575999999,12222.283136]
[6,null,"Antigua and Barbuda","UMIC",89.611999999999995,1070.3737310559948,11940,"http://www.antigua.gov.ag","Ministry of Finance, Economy and Public Administration",1,"http://www.antigua.gov.ag/article_details.php?id=64&category=42",2,"http://www.ab.gov.ag/article_details.php?id=1509&category=38",1,"-",0,"-",0,0,"-",1,1,0,"-",0,"-",1,1,2011,0,null,"-","-",0,null,"-",1,4,1,2009,0,null,"-",1,0,0,1,0,1,1,0,0,0,0,"-",0,"-",0,"-",0,"-",0,"http://ab.gov.ag/article_details.php?id=65","Statistics and Reports","http://www.eccb-centralbank.org","East Caribbean Central Bank","-",1,"http://www.antigua.gov.ag/article_details.php?id=201&category=55",0,"-",0,"-",0,3,"Contact information for other ministries. Social media tools: Facebook, Twitter, Youtube","eng","-","-","-","-","IFMS","Integrated Financial Management System","C","F",1,2012,"C",1,2,"FreeBalance","Web","Aug 2010","Final","X","X","X","X","X","X","X","X","X","X",1.4,1.5333333333333334,"-","-",null,0,49,0.63449999999999995,0.30719999999999997,0.71919999999999995,0.877,"LCR",null,null,null,null,"Antigua and Barbuda",0,null,null,null,null,0,null,null,null,null,null,10,38.461538461538467,"C",null,6,"Antigua and Barbuda","ATG"]
[7,null,"Argentina","UMIC",40764.561000000002,397095.83350659901,9740,"http://www.mecon.gov.ar","Ministerio de Economía y Finanzas Públicas",2,"http://contenidos.mecon.gov.ar/informacion/",2,"http://administracionfinanciera.mecon.gov.ar",3,"http://sitiodelciudadano.mecon.gov.ar/sici/ejecucion_presupuestaria.html",1,"http://www.mecon.gov.ar/peconomica/basehome/serie_gasto.html",1,1,"http://www.mecon.gov.ar/onp/html/ejectexto/bole_trim_dosuno.html?var1=boletrimdosnueve",2,1,1,"http://sitiodelciudadano.mecon.gov.ar/sici/#4",1,"http://www.mecon.gov.ar/onp/html/presutexto/ley2012/leydosdoce.html",1,1,2001,1,1,3,2003,1,1,2004,1,3,1,1994,1,1,1996,1,1,1,1,0,1,1,1,1,1,1,"http://www.mecon.gov.ar/onp/html/#",1,"http://www.argentina.gob.ar",2,"http://administracionfinanciera.mecon.gov.ar./",1,"http://www.mecon.gov.ar/onp/html/manuales/clasificador03.pdf",3,"http://www.indec.mecon.ar","National Institute of Statistics and Censuses ","http://www.bcra.gov.ar ","Central Bank of Argentina ","http://www.mecon.gov.ar/cfrf/",1,"http://contenidos.mecon.gov.ar/direccion-de-informacion-ciudadana-y-seguimiento-parlamentario/",1,"http://contenidos.mecon.gov.ar/ministerio-de-economia-y-finanzas-publicas/",2,"-",1,3,"-","spa","-","-","-","-","SIDIF","Sistema Integrado de Información Financiera","C","F",1,2006,"C+L",2,1,"LDSW > Oracle","CS",2013,"-","-","-","-","-","-","-","-","-","-","-","-","-",50,56,1,2,56,0.62280000000000002,0.52939999999999998,0.43519999999999998,0.90380000000000005,"LCR",null,null,null,null,"Argentina",6,1,1,null,4,10,1,null,1,8,"2013-04-29",25,96.15384615384616,"A",null,7,"Argentina","ARG",2010,"<2",2011,6.5,375,2649.6964650000004]
[8,null,"Armenia","LMIC",3100.2359999999999,10408.625928430067,3360,"http://www.minfin.am","Republic of Armenia Ministry of Finance and Economy",2,"http://www.minfin.am/main.php?lang=1&mode=budget&iseng=1&isarm=1",1,"http://www.minfin.am/up/gbp/GFMIS_Inception%20Report_Final.pdf",1,"-",1,"http://www.minfin.am/main.php?lang=1&mode=poakrep&iseng=1&isarm=1",0,0,"-",1,1,2,"https://www.e-gov.am/interactive-budget/",0,"-",1,1,2003,1,1,3,2003,0,null,"-",1,4,1,2007,1,0,2009,1,1,0,0,0,1,1,0,1,0,0,"-",1,"https://www.e-gov.am",0,"-",0,"-",3,"http://www.armstat.am","National Statistical Service","http://www.cba.am   ","Central Bank of Armenia","http://programmebudgeting.am/",0,"-",1,"http://www.minfin.am/main.php?lang=1&mode=charter&id=37&iseng=1&isarm=1",0,"Internal budget reporting rules and guidelines",0,3,"-","arm","eng","-","-",0,"TS","Treasury System","C","T",1,2006,"C+L",1,1,"LDSW","Web","Oct 2008","Public","A","A","A","B","A","C","C+","D+","D+","A",3.05,3.032258064516129,"-","-",1,3,94,0.49969999999999998,0.32679999999999998,0.32169999999999999,0.85050000000000003,"ECA",null,null,null,null,"Armenia",0,null,null,null,null,0,null,null,null,null,"2013-05-07",16,61.53846153846154,"B",null,8,"Armenia","ARM",2010,2.5,2010,35.799999999999997,77.505899999999997,1109.8844879999999,null,null,"DAD"]
[9,null,"Australia","HIC",22620.6,1111433.6001647334,49130,"http://www.finance.gov.au","Australia Department of Finance and Deregulation",2,"http://www.budget.gov.au/",2,"http://www.finance.gov.au/cbms/CBMS_redevelopment.html",1,"-",1,"http://www.comlaw.gov.au/Details/C2011B00068/Download",0,0,"-",2,1,0,"-",1,"http://www.abs.gov.au/AUSSTATS/abs@.nsf/DetailsPage/5514.02005?OpenDocument",1,1,1996,1,1,4,1996,1,1,1996,1,4,1,1998,1,1,2001,1,1,1,1,1,1,1,1,1,0,1,"https://www.tenders.gov.au/",1,"http://data.australia.gov.au",0,"-",1,"http://www.finance.gov.au/publications/finance-ministers-orders/docs/2011-12-PRIMA-Forms-FMA-and-CAC.pdf",1,"http://www.abs.gov.au","Australian Bureau of Statistics","http://www.rba.gov.au ","Reserve Bank of Australia","-",1,"http://www.finance.gov.au/contact-us.html",1,"http://www.finance.gov.au/policy-legislation.html",2,"-",0,3,"-","eng","-","-","-","-","CBMS","Central Budget Management System","D","F",3,2015,"C+L",1,2,"SAP","Web","-","-","-","-","-","-","-","-","-","-","-","-","-","-","-","-",0,3,12,0.83899999999999997,0.86270000000000002,0.65429999999999999,1,null,"PAC","OECD","APEC",null,"Australia",4,1,2,1,null,8,1,2,5,null,null,20,76.923076923076934,"A",null,9,"Australia","AUS"]
[10,null,"Austria","HIC",8419,405729.98666061915,48190,"http://www.bmf.gv.at","Federal Ministry of Finance",2,"https://www.bmf.gv.at/budget/_start.htm",1,"http://english.bmf.gv.at/budget/theaustrianfederalb_523/_start.htm",1,"-",1,"https://www.bmf.gv.at/Budget/Budgetsimberblick/Sonstiges/Budgetsimberblick/Budgetentwurf2013/berblick/TabellenDownload/_start.htm",0,0,"-",2,1,0,"-",1,"http://www.rechnungshof.gv.at/berichte/bundesrechnungsabschluss.html",1,1,2003,1,1,5,2009,0,null,"-",1,4,1,2002,0,null,"-",1,1,0,1,0,1,0,1,0,0,1,"http://www.peppol.eu/",1,"http://data.gv.at/",0,"-",1,"https://www.bmf.gv.at/BUDGET/budgets/2012/Beilagen/_start_beilagen.htm",1,"http://www.statistik.at","Statistics Austria","http://www.oenb.at   ","Austrian National Bank","https://finanzonline.bmf.gv.at/fon/",1,"http://english.bmf.gv.at/Allgemeines/Impressum/_start.htm",1,"http://english.bmf.gv.at/Ministry/TheTasksoftheFedera_62/DGBudgetPublicFinances/_start.htm",0,"-",0,3,"-","ger","eng","-","-",0,"BAS","Budget and Accounting System","C","T",3,2013,"C+L",1,2,"SAP","Web","-","-","-","-","-","-","-","-","-","-","-","-","-","-","-","-",null,3,21,0.78400000000000003,0.74509999999999998,0.69769999999999999,0.90910000000000002,null,"EU","OECD",null,null,"Austria",2,null,2,null,null,1,null,null,1,null,null,15,57.692307692307686,"B",null,10,"Austria","AUT"]
[11,null,"Azerbaijan","UMIC",9168,48519.703272087085,5290,"http://www.maliyye.gov.az","Ministry of Finance of the Republic of Azerbaijan",1,"http://www.maliyye.gov.az/node/954",1,"http://www.maliyye.gov.az/en/node/886",1,"-",0,"-",0,0,"-",1,1,0,"-",1,"http://www.maliyye.gov.az/en/node/931",1,1,2000,0,null,"-","-",0,null,"-",1,4,0,2000,0,null,"-",1,1,0,0,0,1,0,0,0,0,0,"-",0,"-",0,"-",1,"http://www.maliyye.gov.az/en/node/931",0,"http://www.azstat.org","Azerbaijan State Statistical Committee","http://www.cbar.az","Central Bank of Azerbaijan Republic","-",1,"http://opendata.az/?page_id=32&lang=en",1,"http://www.maliyye.gov.az/en/node/18",0,"National accounting standards",0,3,"-","aze","eng","-","-",0,"TMIS","Treasury Information Management System","C","T",1,2012,"C+L",1,2,"SAP","Web","Jan 2008","Final","X","X","X","X","X","X","X","X","X","X",2.1,2.6333333333333333,42,43,1,0,96,0.49840000000000001,0.36599999999999999,0.30330000000000001,0.82589999999999997,"ECA",null,null,null,null,"Azerbaijan",0,null,null,null,null,0,null,null,null,null,"2013-04-03",9,34.615384615384613,"C",null,11,"Azerbaijan","AZE",2008,"<2",2008,15.8,39,1448.5439999999999]
[12,null,"Bahamas","HIC",347.17599999999999,7778,22403.622370209923,"http://www.bahamas.gov.bs/finance","Ministry of Finance of The Bahamas ",2,"http://www.bahamas.gov.bs/wps/portal/public/NB/Communication/!ut/p/b1/vZTLcpswFIafpQ_gIImbWYIFGGOEzc3AhsHGdsDcUgPCPH3JNDNtM9N000RaafQffTrfaMTETMjEdTrk17TLmzotX9exkLC6be1X3NJaCpwEDOgRA6s7VpfQHIjmAPjLkMHPeqBbsjzX67y9BIYvejuZR0BfAebAhOtoUnBjUFU-JO09qwKpfdm5xmZsCPfc9G17MtNM7cFyAKC2YxIWBqW2zG_ZSg97LAFPOI64pNot10LKl93x3Gv1M0kTnbtIUIs2JE8w4ctHNe5XeTn68BnjRXrG2c5InMBXmmz94j6EHMLWFx_xCcZ2Q1KdTXxY54ZUkgGVrgKv37699ftBQ__wdWDiP5UAAaLXE7ZKsJEgcNFb4AOlZN1UZyaaY-JvN9nK_IyyZy2mBpHPMx4TAi5xi0drTLfJKSbHJF40unhPIT4gSxU94qkP0mXkXqwgVAEgnjxaPkCWqFIvO-6ywPEVeYXvezd-D7SR99rbCgqmzwOXA58NfOfahF8NZL9UqY7BpwPfPZod-u_ADRPnx-qJnqon8MSLgOOWSOAlJHJLiWOCIuJEzBlUM4JkcljIdjfiYrnKq6600tAHpjuU8qBd0ALf-MHLRhHbbkEtb71WR2U_DWWj1JlP91o3DU1smhGVG-RujotCKbfKPUmtxOWQc9VAL152fHvH1Wl7y4J116a9PFVqx_YwC6gF6bHW9EcYK_JCTUbWOLdF0WqEV1WSp_s-pE4TxPGmHwverK-iPlDT_H47jndug4YgumgoS5E8_xFt5Q9bwVmSy69pzRs_ALZ5AFQ!/dl4/d5/L2dBISEvZ0FBIS9nQSEh/",1,"http://www.docstoc.com/docs/111076420/THE-BAHAMAS",1,"-",0,"-",0,0,"-",2,1,0,"-",0,"-",1,1,2001,0,null,"-","-",0,null,"-",1,4,1,2001,0,null,"-",1,1,0,1,1,1,1,0,1,0,0,"-",0,"-",0,"-",0,"-",0,"http://statistics.bahamas.gov.bs","The Department of Statistics","http://centralbankbahamas.com","Central Bank of The Bahamas","-",0,"-",1,"http://www.bahamas.gov.bs/wps/portal/public/",0,"-",0,1,"-","eng","-","-","-","-","TFMS","Treasury Financial Management System","C","T",3,2014,"C",1,0,"?","Web","Mar 2011","Final","X","X","X","X","X","X","X","X","X","X",1.9375,1.8461538461538463,"-","-",null,"-",65,0.57930000000000004,0.47060000000000002,0.45540000000000003,0.81200000000000006,"LCR",null,null,null,null,"Bahamas",0,null,null,null,null,0,null,null,null,null,null,11,42.307692307692307,"C",null,12,"Bahamas","BHS",null,null,2001,9.3000000000000007,null,32.287368000000001]
[13,null,"Bahrain","HIC",1323.5350000000001,22950,17339.92678697579,"http://www.mof.gov.bh","Ministry of Finance - Kingdom of Bahrain",2,"http://www.mof.gov.bh/Categorylist.asp?cType=budget",2,"http://www.mof.gov.bh/Categorylist.asp?cType=fmis",1,"-",0,"-",0,0,"-",1,1,0,"-",1,"http://www.mof.gov.bh/Categorylist.asp?cType=fmanual",1,1,2003,1,1,5,1990,0,null,"-",1,4,1,2003,0,null,"-",1,1,0,0,0,1,1,0,1,0,1,"http://www.tenderboard.gov.bh/",1,"http://www.bahrain.bh/wps/portal/data",0,"-",0,"-",0,"http://www.cio.gov.bh","Central Informatics Organization ","http://www.bma.gov.bh ","Central Bank of Bahrain","-",0,"-",1,"http://www.mof.gov.bh/CategoryListImage.asp?cType=organ",0,"National accounting standards",0,3,"-","ara","eng","-","-",0,"CFS","Central Financial System","C","T",1,2006,"C",1,2,"Oracle","Web","-","-","-","-","-","-","-","-","-","-","-","-","-","-","-","-",null,1,36,0.6946,0.86270000000000002,0.41830000000000001,0.80279999999999996,"MNA",null,null,null,null,"Bahrain",1,null,null,1,null,0,null,null,null,null,null,14,53.846153846153847,"B",null,13,"Bahrain","BHR"]
[14,null,"Bangladesh","LIC",150493.658,117761.95368496834,780,"http://www.mof.gov.bd","Bangladesh Ministry of Finance",2,"http://www.mof.gov.bd/en/index.php?option=com_content&view=article&id=184&Itemid=1",1,"http://www.mof.gov.bd/en/budget/11_12/digital_bd/digital_bangladesh_en.pdf",1,"http://www.mof.gov.bd/en/index.php?option=com_content&view=article&id=68&Itemid=1",0,"-",0,0,"-",2,1,1,"http://www.mof.gov.bd/en/budget/booklet/booklet_en.pdf",1,"http://www.mof.gov.bd/en/index.php?option=com_content&view=article&id=80&Itemid=1&phpMyAdmin=XRGktGpDJ7v31TJLuZ5xtAQmRx9",1,1,2007,1,1,5,2011,1,1,2011,1,4,1,2007,0,null,"-",1,1,0,1,1,1,1,1,1,0,0,"-",0,"-",0,"-",0,"-",0,"http://www.bbs.gov.bd","Bangladesh Bureau of Statistics","http://www.bangladesh-bank.org ","Bangladesh Bank","-",0,"-",1,"http://www.mof.gov.bd/en/index.php?option=com_content&view=article&id=48&Itemid=1",2,"GFS 1986",1,3,"-","ben","eng","-","-",1,"iBAS","Integrated Budget and Accounting System","C","T",3,2014,"C+L",1,1,"LDSW","Web","Dec 2011","Final","X","X","X","X","X","X","X","X","X","X",2.4500000000000002,2.1166666666666667,58,48,null,1,150,0.29909999999999998,0.44440000000000002,6.4100000000000004E-2,0.38890000000000002,"SAR",null,null,null,null,"Bangladesh",0,null,null,null,null,0,null,null,null,null,"2013-05-05",17,65.384615384615387,"B",null,14,"Bangladesh","BGD",2010,43.3,2010,31.5,65163.753913999994,47405.502269999997]
[15,null,"Barbados","HIC",273.92500000000001,3685,13452.5873870585,"http://www.gov.bb/bigportal/gov/index.php?method=detail&cat=min&rnum=351&np=3","Barbados Ministry of Finance and Economic Affairs",0,"http://www.economicaffairs.gov.bb",2,"http://treasury.gov.bb/?q=content/about-us",0,"-",0,"-",0,0,"-",0,0,0,"-",0,"-",1,0,2009,0,null,"-","-",0,null,"-",1,4,1,2009,0,null,"-",1,1,0,1,1,1,1,0,1,0,0,"-",0,"-",0,"-",0,"-",2,"http://www.barstats.gov.bb","Barbados Statistical Services","http://www.centralbank.org.bb ","Central Bank of Barbados","http://www.barbadosparliament.com/",0,"-",0,"-",0,"-",0,1,"-","eng","-","-","-","-","FMIS","Financial Management Information System","C","F",1,1999,"C",1,2,"SmartStream","Web","Jul 2010","Draft","X","X","X","X","X","X","X","X","X","X",3.1666666666666665,2.7884615384615383,"-","-",null,1,44,0.65659999999999996,0.3725,0.67400000000000004,0.92320000000000002,"LCR",null,null,null,null,"Barbados",0,null,null,null,null,0,null,null,null,null,"2013-05-03",5,19.230769230769234,"D",null,15,"Barbados","BRB"]
[16,null,"Belarus","UMIC",9473,55236.125763229888,5830,"http://www.minfin.gov.by ","Ministry for Finance of Belarus",2,"http://www.minfin.gov.by/rmenu/execution/month-info/",1,"http://siteresources.worldbank.org/BELARUSEXTN/Resources/PEFA_Belarus_april_2009_english.pdf",1,"-",0,"-",0,0,"-",2,1,0,"-",0,"-",0,null,"-",0,null,"-","-",0,null,"-",1,2,1,2005,0,null,"-",1,1,1,0,1,1,1,1,1,0,0,"-",0,"-",0,"-",1,"http://www.minfin.gov.by/rmenu/gfs/general/",0,"http://www.belstat.gov.by","Belarus Ministry of Statistics and Analysis","http://www.nbrb.by","National Bank of the Republic of Belarus","-",0,"-",1,"http://www.minfin.gov.by/ministerstvo/structure/",2,"-",0,3,"-","rus","-","-","-","-","TS","Treasury System","C","T",1,2002,"C+L",1,1,"LDSW","Web","Apr 2009","Public","A","A","C","D+","A","B","B+","C+","D+","NU",2.8888888888888888,3.0892857142857144,"-","-",null,0,61,0.60899999999999999,0.4118,0.50329999999999997,0.91200000000000003,"ECA",null,null,null,null,"Belarus",0,null,null,null,null,0,null,null,null,null,null,9,34.615384615384613,"C",null,16,"Belarus","BLR",2010,"<2",2009,5.4,7,511.54200000000003]
[17,null,"Belgium","HIC",11008,506234.97313837998,45990,"http://www.treasury.fgov.be","Belgian Administration of the Treasury",2,"http://www.begroting.be/portal/page/portal/INTERNET_pagegroup/INTERNET_home/TAB149685",1,"http://www.begroting.be/portal/page/portal/INTERNET_pagegroup/INTERNET_fedcom",1,"http://www.begroting.be/portal/page/portal/INTERNET_pagegroup/INTERNET_ontvangst",0,"-",0,0,"-",2,1,0,"-",1,"http://www.begroting.be/portal/page/portal/INTERNET_pagegroup/INTERNET_hergroepering",1,1,2007,1,1,4,2006,0,null,"-",1,4,1,2007,1,1,2007,1,1,1,1,1,1,1,1,1,1,0,"-",1,"http://data.gov.be",0,"-",1,"http://www.begroting.be/portal/page/portal/INTERNET_pagegroup/INTERNET_algemenegegevensbank",2,"http://statbel.fgov.be","Belgium National Institute of Statistics","http://www.bnb.be    ","National Bank of Belgium","http://ccff02.minfin.fgov.be/KMWeb/",1,"http://www.freedominfo.org/wp-content/uploads/documents/global_survey2006.pdf",1,"http://www.begroting.be/portal/page/portal/INTERNET_pagegroup/INTERNET_voorschriften/TAB149685",2,"-",0,3,"-","dut","fre","eng","-",0,"FEDCOM","Federal Public Budget and Management Control","C","T",1,2009,"C+L",1,2,"SAP","Web","-","-","-","-","-","-","-","-","-","-","-","-","-","-","-","-",null,1,24,0.77180000000000004,0.64710000000000001,0.74199999999999999,0.9264,null,"EU","OECD",null,null,"Belgium",5,1,1,2,1,2,null,null,null,2,null,16,61.53846153846154,"B",null,17,"Belgium","BEL"]
[18,null,"Belize","LMIC",356.6,1322.3939307303237,3710,"http://www.mof.gov.bz","Ministry of Finance of Belize",0,"http://www.belize.gov.bz/public/Attachment/262911553071.pdf",1,"http://sifbelize.org/LinkClick.aspx?fileticket=WJ4Ue5aFZSc%3D&tabid=74",0,"-",0,"-",0,0,"-",1,1,0,"-",0,"http://www.mof.gov.bz/dms20uc/dm_browse.asp?pid=84",1,1,2001,0,null,"-","-",0,null,"-",1,4,0,2012,0,null,"-",1,0,0,0,0,1,1,0,0,0,0,"-",1,"http://www.belize.gov.bz",0,"-",0,"-",0,"http://statisticsbelize.org.bz","Statistical Institute of Belize","http://www.centralbank.org.bz  ","Central Bank of Belize","-",0,"-",1,"http://www.mof.gov.bz/aboutus.asp",0,"-",0,3,"Option for subscription to Ministry of Finance Newsletter","eng ","-","-","-","-","FS","Financial System","C","F",1,1999,"C",1,2,"SmartStream","Web","Jan 2009","Final","X","X","X","X","X","X","X","X","X","X",1.55,1.7741935483870968,"-","-",null,0,124,0.39229999999999998,0.3987,0.16270000000000001,0.61550000000000005,"LCR",null,null,null,null,"Belize",0,null,null,null,null,0,null,null,null,null,"2013-05-06",6,23.076923076923077,"D",null,18,"Belize","BLZ",1999,12.2,2002,33.5,43.505200000000002,119.461]
[19,null,"Benin","LIC",9099.9220000000005,7119.5677967903339,780,"http://www.gouv.bj/gouvernement","Benin Ministry of Economy and Finances",0,"-",2,"http://www.sndi.ci/component/content/article/78",0,"-",0,"-",0,0,"-",0,0,0,"-",0,"-",0,null,"-",0,null,"-","-",0,null,"-",0,null,null,"-",0,null,"-",0,0,0,0,0,0,0,0,0,0,0,"-",0,"-",0,"-",0,"-",0,"http://insae-bj.org ","Institut national de la statistique et de l'analyse économique French (INSAE)","http://www.bceao.int ","Central Bank of West African States (BCEAO)","-",0,"-",0,"-",0,"-",0,1,"-","fre","-","-","-","-","ASTER/SIGFIP","Application des Services du Trésor en Réseau / Système Intégré de Gestion des Finances Publiques","C","T",1,2004,"C",1,1,"LDSW > Oracle","CS","Sep 2007","Public","C","C","C","B+","C","D","C","D+","D","D+",1.85,1.967741935483871,1,"-",null,2,179,0.2064,0.1961,0.1118,0.31130000000000002,"AFR",null,null,null,null,"Benin",1,null,1,null,null,0,null,null,null,null,null,2,7.6923076923076925,"D",null,19,"Benin","BEN",2003,47.3,2007,33.299999999999997,4304.2631059999994,3030.2740259999996]
[20,null,"Bhutan","LMIC",738.26700000000005,1569.4495399427042,2130,"http://www.mof.gov.bt","Bhutan Ministry of Finance",2,"http://www.mof.gov.bt/index.php?deptid=17&id=27",1,"http://pid.adb.org/pid/TaView.htm?projNo=41152&seqNo=01&typeCd=2",1,"-",0,"-",0,0,"-",2,1,0,"-",1,"http://www.mof.gov.bt/index.php?deptid=13&id=79",1,1,1993,1,1,3,2007,0,null,"-",1,4,1,1993,0,null,"-",1,1,1,0,0,1,1,1,1,0,0,"-",0,"-",0,"-",1,"http://www.mof.gov.bt/downloads/BudgetReportFY2008-09.pdf",0,"http://www.nsb.gov.bt","Bhutan National Statistics Bureau","http://www.rma.org.bt ","Royal Monetary Authority of Bhutan","-",0,"-",1,"http://www.mof.gov.bt/index.php?deptid=11&id=53",0,"-",0,1,"-","eng","-","-","-","-","PEMS","Public Expenditure Management System","C","F",1,2008,"C+L",1,1,"LDSW","Web","Jun 2010","Public","B","A","B","B+","B","A","D+","C+","B+","D+",2.95,2.9666666666666668,"-","-",null,1,152,0.29420000000000002,0.35289999999999999,0.1143,0.4153,"SAR",null,null,null,null,"Bhutan",0,null,null,null,null,0,null,null,null,null,null,14,53.846153846153847,"B",null,20,"Bhutan","BTN",2007,10.199999999999999,2007,23.2,75.303234000000003,171.27794400000002]
[21,null,"Bolivia","LMIC",10088.108,20421.58359994748,2020,"http://www.economiayfinanzas.gob.bo","Ministerio de Economía y Finanzas Públicas",2,"http://www.economiayfinanzas.gob.bo/index.php?opcion=com_indicadores&ver=indicadores&idc=585",2,"http://www.sigma.gob.bo/php/index.php",2,"http://vmpc.economiayfinanzas.gob.bo/financiera0.asp",1,"http://www.economiayfinanzas.gob.bo/index.php?opcion=com_indicadores&ver=indicadores&idc=582",1,1,"http://medios.economiayfinanzas.gob.bo/MH/documentos/ppto2011/index.htm",2,1,0,"-",1,"http://vmpc.economiayfinanzas.gob.bo/modelos_c.asp",1,1,2001,0,null,"-","-",0,null,"-",1,4,1,2001,1,1,2001,1,1,1,0,0,1,1,1,1,1,0,"-",0,"-",2,"http://www.sigma.gob.bo/pgn/sfpm2011/index.htm?&id_item=527",1,"http://www.economiayfinanzas.gob.bo/index.php?opcion=com_contenido&ver=contenido&id=2094&id_item=625&id_item=489",1,"http://www.ine.gob.bo","National Institute of Statistics","http://www.bcb.gob.bo   ","Central Bank of Bolivia","-",1,"http://www.economiayfinanzas.gob.bo/index.php?opcion=com_contenido&ver=contenido&id=834&id_item=464",1,"http://www.economiayfinanzas.gob.bo/institucion/estorgpdf.php?sw=0",0,"National laws and regulations",1,3,"-","spa","eng","-","-",0,"SIGMA","Sistema Integrado de Gestión y Modernización Administrativa","C","F",2,2003,"C+L",1,1,"LDSW > Oracle","Web","Oct 2009","Public","A","C","B","C","B","D","C+","D+","D+","C",2.25,2.5172413793103448,12,13,null,0,106,0.46579999999999999,0.4118,0.17860000000000001,0.80720000000000003,"LCR",null,null,null,null,"Bolivia",1,null,null,1,null,0,null,null,null,null,null,19,73.076923076923066,"B",null,21,"Bolivia","BOL",2008,15.6,2009,51.3,1573.744848,5175.199404]
[22,null,"Bosnia and Herzegovina","UMIC",3752.2280000000001,17950.881762669222,4780,"http://www.fmf.gov.ba","Bosnia and Herzegovina Ministry of Finance",2,"http://www.fmf.gov.ba/",1,"http://www.fiscalreform.net/pdfs/bosnia_treasury_and_payment_bureaus.pdf",1,"-",0,"-",0,0,"-",1,1,0,"-",1,"http://www.fmf.gov.ba/zakoni/2010/bosanski/pravilnici/Pravilnik%20o%20kontnom%20okviru,sadrzaju%20konta%20i%20primjeni%20kontnog%20okvira%20za%20banke%20i%20druge%20financijske%20organizacije.pdf",1,1,2000,1,1,3,2008,0,null,"-",1,4,0,2006,1,0,2011,1,1,0,0,0,1,1,1,1,0,0,"-",0,"-",0,"-",0,"-",0,"http://www.bhas.ba","Bosnia and Herzegovina Agency for Statistics","http://www.cbbh.ba ","Central Bank of Bosnia and Herzegovina ","-",0,"-",1,"http://www.fmf.gov.ba/publikacije/Unutarnje_ustrojstvo.pdf",0,"National laws and regulations",0,2,"-","hrv","bos","eng","-",0,"FMIS","Financial Management Information System","D","F",1,2004,"C+L",1,2,"Oracle","Web","-","-","-","-","-","-","-","-","-","-","-","-","-","-",50,44,null,2,79,0.53280000000000005,0.3725,0.39169999999999999,0.83409999999999995,"ECA",null,null,null,"F","Bosnia and Herzegovina",0,null,null,null,null,0,null,null,null,null,null,13,50,"B",null,22,"Bosnia and Herzegovina","BIH",2007,"<2",2007,14,2,525.31191999999999]
[23,null,"Botswana","UMIC",2030.7380000000001,15175.777449291219,7470,"http://www.finance.gov.bw","Botswana - Ministry of Finance and Development Planning",2,"http://www.finance.gov.bw/index.php?option=com_content1&parent_id=334&id=336",1,"http://www.oag.org.bw/wp-content/uploads/2008/11/GovernmentAccountingandBudgetingSystem%20_GABS_%202007.pdf",1,"-",0,"-",0,0,"-",1,1,0,null,0,"-",0,null,"-",0,null,"-","-",0,null,"-",1,4,0,2005,1,1,2002,1,1,0,0,0,1,1,0,0,0,0,"-",0,"-",0,"-",0,"-",0,"http://www.cso.gov.bw","Botswana Central Statistics Office ","http://www.bankofbotswana.bw ","Bank of Botswana","-",0,"-",0,"-",0,"-",0,3,"-","eng","-","-","-","-","GABS","Government Accounting and Budgeting System","C","F",3,2004,"C+L",1,2,"Oracle","Web","Feb 2009","Public","C","A","B","C+","B","A","C+","C+","D+","D+",2.65,2.4516129032258065,50,51,null,1,121,0.41860000000000003,0.35949999999999999,0.18729999999999999,0.70909999999999995,"AFR",null,null,null,null,"Botswana",0,null,null,null,null,0,null,null,null,null,"2013-05-06",9,34.615384615384613,"C",null,23,"Botswana","BWA",1994,31.2,2003,30.6,633.59025599999995,621.40582800000004]
[24,null,"Brazil","UMIC",196655.014,2107744.9665087764,10720,"http://www.fazenda.gov.br","Ministry of Finance of Brazil",2,"http://www.stn.fazenda.gov.br",2,"https://www.tesouro.fazenda.gov.br/pt/siafi",3,"https://www.tesouro.fazenda.gov.br/index.php?option=com_content&view=article&layout=subhome&id=234&Itemid=436&lang=pt",1,"https://www.tesouro.fazenda.gov.br/pt/servicos/series-historicas",1,1,"http://consulta.tesouro.fazenda.gov.br/cofin_novosite/dotacao_vs_desp_param.asp",2,1,2,"http://www.portaldatransparencia.gov.br/",1,"http://www.stn.fazenda.gov.br/contabilidade_governamental/plano_contas.asp",1,1,1980,1,1,3,2003,1,1,2003,1,2,1,1980,1,1,2004,1,1,1,0,1,1,1,1,1,1,1,"http://www.portaldatransparencia.gov.br/",1,"http://dados.gov.br/",2,"http://manualsiafi.tesouro.fazenda.gov.br/150000",1,"http://www.fazenda.gov.br/",3,"http://www.ibge.gov.br/english/default.php ","Brazilian Institute of Geography and Statistics (IBGE)","http://www.bcb.gov.br ","Central Bank of Brazil","http://www.bcb.gov.br/?INDECO; http://www.stn.fazenda.gov.br/hp/resultado.asp",1,"http://www.fazenda.gov.br/acessoainformacao/",1,"http://www.fazenda.gov.br/",2,"National laws and regulations",1,3,"Youtube, Twitter","por","eng","-","-",0,"SIAFI + SIOP","Sistema Integrado de Administração Financeira do Governo Federal","C","F",1,1987,"C+L",1,1,"LDSW + OSS","Web","Dec 2009","Public","A","A","A","B","A","A","A","C+","C+","NU",3.5555555555555554,3.5178571428571428,73,71,1,1,59,0.61670000000000003,0.67320000000000002,0.35680000000000001,0.82030000000000003,"LCR",null,null,null,null,"Brazil",9,4,1,2,2,11,2,null,8,1,null,26,100,"A",null,24,"Brazil","BRA",2009,6.1,2009,21.4,11995.955854,42084.172995999994]
[25,null,"Brunei Darussalam","HIC",405.93799999999999,16360,40301.720952460717,"http://www.mof.gov.bn","Ministry of Finance",0,"-",2,"http://www.mof.gov.bn/English/Treasury/Background/Pages/default.aspx",0,"-",0,"-",0,0,"-",0,0,0,"-",0,"-",0,null,"-",0,null,"-","-",0,null,"-",0,null,null,"-",0,null,"-",0,0,0,0,0,0,0,0,0,0,0,"-",0,"-",0,"-",0,"-",0,"http://www.depd.gov.bn/dept_dos.html","Dept of Econ Planning and Dev - Dept of Statistics","http://www.mof.gov.bn/English/BCMB/Pages/default.aspx","Brunei Currency and Monetary Board","-",0,"-",1,"http://www.mof.gov.bn/English/Administration/AboutUs/OrganisationalStructure/Pages/default.aspx",0,"-",0,0,"-","eng","-","-","-","-","TAFIS","Treasury Accounting and Financial Information System","C","T",1,2002,"C",1,1,"LDSW > Oracle","Web","-","-","-","-","-","-","-","-","-","-","-","-","-","-","-","-",null,"-",54,0.625,0.5948,0.45500000000000002,0.82530000000000003,null,"PAC",null,"APEC",null,"Brunei Darussalam",0,null,null,null,null,0,null,null,null,null,null,2,7.6923076923076925,"D",null,25,"Brunei Darussalam","BRN"]
[26,null,"Bulgaria","UMIC",7476,48818.742595797827,6530,"http://www.minfin.bg","Ministry of Finance of the Republic of Bulgaria",2,"http://www.minfin.bg/bg/page/4",2,"http://www.minfin.bg/en/documents/?cat=1&vid=-1&dq=FMIS",1,"-",1,"http://www.minfin.bg/bg/statistics/7",0,0,"-",1,1,0,"-",0,"-",1,1,1997,1,1,3,2007,0,null,"-",1,2,1,2002,0,null,"-",1,1,0,0,0,1,1,1,0,0,0,"-",1,"http://parliament.yurukov.net/index_en.html",0,"-",1,"http://www.minfin.bg/bg/statistics/11",1,"http://www.nsi.bg","Bulgaria National Statistical Institute","http://www.bnb.bg ","Bulgarian National Bank","-",0,"-",0,"-",2,"National laws and regulations",0,3,"There is a provision for reporting corruption alerts","bul","eng","-","-",0,"FMIS","Financial Management Information System","C","T",3,2009,"C",1,1,"LDSW","Web","-","-","-","-","-","-","-","-","-","-","-","-","-","-",65,56,1,3,60,0.61319999999999997,0.49020000000000002,0.50060000000000004,0.84860000000000002,"ECA","EU",null,null,null,"Bulgaria",3,2,null,null,1,0,null,null,null,null,null,14,53.846153846153847,"B",null,26,"Bulgaria","BGR",2007,"<2",2007,10.6,null,792.4559999999999]
[27,null,"Burkina Faso","LIC",16967.845000000001,9695.861998877208,570,"http://www.finances.gov.bf","Burkina Faso - Ministère de l'économie et des finances",2,"http://www.dgb.gov.bf/documents.php",2,"http://www.tresor.bf/spip.php?page=articleS&id_article=29",1,"-",0,"-",0,0,"-",1,1,0,"-",1,"http://www.finances.gov.bf/IMG/pdf/Budget_Entier.pdf",1,0,2009,1,0,3,2011,0,null,"-",1,4,0,2009,0,null,"-",1,1,0,0,0,1,1,0,0,1,0,"-",0,"-",2,"http://www.tresor.bf/pages/infor_collectivites.htm",1,"http://www.finances.gov.bf/IMG/pdf/Budget_Entier.pdf",2,"http://www.insd.bf","Institut national de la statistique et de la démographie (INSD) ","http://www.bceao.int ","Central Bank of West African States (BCEAO)","http://www.tresor.bf",0,"-",1,"http://www.finances.gov.bf/spip.php?article7",2,"-",1,3,"There is webmail access to the Ministry of Finance website","fre","-","-","-","-","CID","Circuit Informatisé de la Dépense / Integrated Expenditure System","C","T",1,2000,"C",1,2,"Oracle","CS","Jun 2010","Public","A","A","C","B+","C+","D","A","B+","D+","C+",2.85,2.7903225806451615,23,5,null,3,185,0.1578,0.29409999999999997,4.5400000000000003E-2,0.1338,"AFR",null,null,null,null,"Burkina Faso",0,null,null,null,null,0,null,null,null,null,null,11,42.307692307692307,"C",null,27,"Burkina Faso","BFA",2009,44.6,2009,46.7,7567.6588700000011,7923.983615000001,null,2008]
[28,null,"Burundi","LIC",8575.1720000000005,2158.1281950012471,250,"http://www.burundi-gov.bi/Composition-du-Gouvernement-de-la","Ministry of Finance",0,"-",2,"http://www.page.bi/spip.php?article35",0,"-",0,"-",0,0,"-",0,0,0,"-",0,"-",0,null,"-",0,null,"-","-",0,null,"-",0,null,null,"-",0,null,"-",0,0,0,0,0,0,0,0,0,0,0,"-",0,"-",0,"-",0,"-",0,"http://burundistats.org","Institut de Statistiques et Des Etudes Economiques du Burundi","http://www.brb-bi.net ","Bank of the Republic of Burundi","-",0,"-",0,"-",0,"-",0,0,"-","fre","-","-","-","-","SIGEFI","Système Intégré de Gestion des Finances / Integrated Public Financial Management System","C","T",1,2004,"C",1,1,"LDSW > MS SQL","Web","Feb 2012","Final","X","X","X","X","X","X","X","X","X","X",2.75,2.4137931034482758,"-","-",null,1,173,0.2288,0.15029999999999999,1.7299999999999999E-2,0.51880000000000004,"AFR",null,null,null,"F","Burundi",0,null,null,null,null,0,null,null,null,null,null,2,7.6923076923076925,"D",null,28,"Burundi","BDI",2006,81.3,2006,66.900000000000006,6971.6148360000007,5736.7900680000012]
[29,null,"Cambodia","LIC",14305.183000000001,11673.477784457325,820,"http://www.mef.gov.kh","Ministry of Economy and Finance of Cambodia",1,"http://www.mef.gov.kh/tofe.html",2,"http://fmis.mef.gov.kh",1,"-",0,"-",0,0,"-",0,0,0,"-",1,"http://www.mef.gov.kh/budget.html",1,0,2010,1,0,4,2010,0,null,"-",1,2,1,2009,0,null,"-",0,0,0,0,0,0,0,0,0,0,0,"-",0,"-",1,"http://fmis.mef.gov.kh/fmis-project/fmis-project-plan.html",0,"-",2,"http://www.nis.gov.kh","Cambodia National Institute of Statistics ","http://www.nbc.org.kh ","National Bank of Cambodia","http://www.treasury.gov.kh",0,"-",1,"http://www.mef.gov.kh/about-ministry.html",2,"-",0,2,"-","khm","eng","-","-",0,"FMIS","Financial Management Information System","C","T",4,2016,"C+L",2,0,"?","Web","Feb 2010","Draft","X","X","X","X","X","X","X","X","X","X",2.0499999999999998,2.1896551724137931,15,15,null,2,155,0.29020000000000001,0.1895,8.14E-2,0.59970000000000001,"EAP",null,null,null,null,"Cambodia",3,null,null,3,null,0,null,null,null,null,null,9,34.615384615384613,"C",null,29,"Cambodia","KHM",2009,18.600000000000001,2007,30.1,2660.7640380000003,4305.8600830000005]
[30,null,"Cameroon","LMIC",20030.362000000001,24137.505192463417,1210,"http://www.prc.cm","Cameroon Ministry of Finance and Economy",0,"-",1,"http://www-wds.worldbank.org/external/default/WDSContentServer/WDSP/IB/2008/09/04/000334955_20080904030253/Rendered/PDF/433690PAD0P0841LY10IDA1R20081019311.pdf",0,"-",0,"-",0,0,"-",0,0,1,"http://cameroon.openspending.org/en/index.html",0,"-",0,null,"-",0,null,"-","-",0,null,"-",0,null,null,"-",0,null,"-",0,0,0,0,0,0,0,0,0,0,0,"-",0,"-",0,"-",0,"-",0,"http://www.statistics-cameroon.org","Cameron Institut National de la Statistique","http://www.beac.int ","Bank of Central African States","-",0,"-",0,"-",0,"-",0,0,"-","fre","eng","-","-",0,"SIGEFI","Système Intégré de Gestion des Finances / Integrated Public Financial Management System","C","T",1,2004,"C",1,1,"LDSW > MS SQL","Web","Jan 2008","Final","X","X","X","X","X","X","X","X","X","X",1.9,2,10,2,null,1,147,0.307,0.30070000000000002,6.4899999999999999E-2,0.5554,"AFR",null,null,null,null,"Cameroon",0,null,null,null,null,0,null,null,null,null,null,2,7.6923076923076925,"D",null,30,"Cameroon","CMR",2007,9.6,2007,39.9,1922.9147520000001,7992.1144380000005,null,null,"DAD"]
[31,null,"Canada","HIC",34482.779000000002,1570886.1278538189,45560,"http://www.fin.gc.ca","Canada Department of Finance",2,"http://www.fin.gc.ca/access/budinfo-eng.asp",2,"http://www.freebalance.com/customers/north_america.asp",1,"-",0,"-",0,0,"-",2,1,0,"-",0,"-",1,1,1990,1,1,5,1995,0,null,"-",1,4,1,1995,1,1,2004,1,1,0,0,1,1,1,1,1,0,0,"-",1,"http://www.data.gc.ca/default.asp?lang=En",0,"-",0,"-",1,"http://www.statcan.gc.ca","Statistics Canada","http://www.bankofcanada.ca","Bank of Canada - Banque du Canada","-",1,"http://www.fin.gc.ca/admin/notices-avis-eng.asp",1,"http://www.fin.gc.ca/afc/index-eng.asp",0,"-",0,3,"Availability of FAQs (Frequently Asked Questions)","eng","fre","-","-",1,"GFMIS","Government Financial Management Information System","D","F",1,1994,"C+L",1,2,"FreeBalance","Web","-","-","-","-","-","-","-","-","-","-","-","-","-","-","-","-",1,3,11,0.84299999999999997,0.88890000000000002,0.71630000000000005,0.92379999999999995,null,"AME","OECD","APEC",null,"Canada",1,null,1,null,null,1,null,1,null,null,null,16,61.53846153846154,"B",null,31,"Canada","CAN"]
[32,null,"Cape Verde","LMIC",500.58499999999998,1772.9461953581128,3540,"http://www.minfin.gov.cv","Ministério das Finanças e do Planeamento",2,"http://www.minfin.gov.cv/index.php?option=com_docman&Itemid=165",2,"http://www.nosi.cv/index.php?option=com_content&view=article&id=92&Itemid=125&lang=en",1,"-",0,"-",0,0,"-",2,1,0,"-",1,"http://www.minfin.gov.cv/",1,0,2006,1,1,3,2006,1,0,2010,1,3,1,2006,0,null,"-",1,1,1,0,0,1,0,1,0,0,0,"-",0,"-",2,"http://www.nosi.cv/index.php?option=com_content&view=article&id=93&Itemid=124&lang=en",1,"http://www.oge2011.gov.cv/index.php?option=com_docman&Itemid=58",2,"http://www.ine.cv","National Statistical Institute","http://www.bcv.cv","Banco de Cabo Verde","http://www.bcv.cv/vPT/Paginas/Homepage.aspx",0,"-",1,"http://www.minfin.gov.cv/",0,"-",0,3,"-","por","-","-","-","-","SIGOF","Sistema Integrado de Gestão Orçamental e Financeira","C","T",1,2002,"C",1,1,"LDSW > Oracle","CS","Dec 2008","Public","B","A","C","C+","B+","D","C+","C+","D+","D",2.35,2.661290322580645,"-","-",null,2,118,0.42970000000000003,0.43790000000000001,0.2268,0.62450000000000006,"AFR",null,null,null,null,"Cape Verde",0,null,null,null,null,0,null,null,null,null,null,15,57.692307692307686,"B",null,32,"Cape Verde","CPV",2002,21,2007,26.6,105.12285,133.15561,null,null,"DAD"]
[33,null,"Central African Republic","LIC",4486.8370000000004,2139.3816636337942,480,"http://www.afdevinfo.com/htmlreports/org/org_38461.html","Ministry of Finance",0,"-",1,"http://www-wds.worldbank.org/external/default/WDSContentServer/WDSP/IB/2010/12/08/000333037_20101208231702/Rendered/PDF/ICR16820ICR0P11OFFICIAL0USE0ONLY191.pdf",0,"-",0,"-",0,0,"-",0,0,0,"-",0,"-",0,null,"-",0,null,"-","-",0,null,"-",0,null,null,"-",0,null,"-",0,0,0,0,0,0,0,0,0,0,0,"-",0,"-",0,"-",0,"-",1,"http://www.stat-centrafrique.com","Institut centrafricain des statistiques, des études économiques et sociales (ICASEES)","http://www.beac.int ","Bank of Central African States","-",0,"-",0,"-",0,"-",0,0,"-","fre","eng","-","-",0,"GFMIS","Government Financial Management Information System / GES'CO","C","T",1,2010,"C",1,1,"LDSW","Web","Jul 2010","Public","B","C","C","D+","D","D","D+","D+","D","D",1.55,1.6774193548387097,"-","-",null,0,"-","-","-","-","-","AFR",null,null,null,"F","Central African Republic",0,null,null,null,null,0,null,null,null,null,null,{"$f":"J35+L35+N35+P35+R35+S35+U35+V35+W35+Y35+AA35+AB35+AD35+AE35+AH35+AI35+AK35+AM35+AO35+AP35","v":1},3.8461538461538463,"D",null,33,"Central African Republic","CAF",2008,62.8,2008,62,2817.7336360000004,2781.8389400000001,null,null,"DAD"]
[34,null,"Chad","LIC",11525.495999999999,8005.9149955398452,690,"http://www.presidencetchad.org","Ministry of Finance",0,"-",1,"http://www-wds.worldbank.org/external/default/WDSContentServer/WDSP/IB/2007/09/19/000020439_20070919084700/Rendered/PDF/32710.pdf",0,"-",0,"-",0,0,"-",0,0,0,"-",0,"-",0,null,"-",0,null,"-","-",0,null,"-",0,null,null,"-",0,null,"-",0,0,0,0,0,0,0,0,0,0,0,"-",0,"-",0,"-",0,"-",0,"http://www.inseed-tchad.org","Institut national de la statistique, des études économiques et démographiques (INSEED)","http://www.beac.int","Bank of Central African States","-",0,"-",0,"-",0,"-",0,0,"-","fre","ara","-","-",0,"CID","Circuit Informatisé de la Dépense / Integrated Expenditure System","C","T",1,2000,"C",1,2,"Oracle","CS","Jul 2009","Final","X","X","X","X","X","X","X","X","X","X",1.95,1.9166666666666667,3,0,null,2,189,0.10920000000000001,9.8000000000000004E-2,2.9100000000000001E-2,0.20030000000000001,"AFR",null,null,null,"F","Chad",0,null,null,null,null,0,null,null,null,null,null,1,3.8461538461538463,"D",null,34,"Chad","TCD",2003,61.9,2003,55,7134.2820239999992,6339.0227999999988]
[35,null,"Chile","UMIC",17269.525000000001,212003.23986325794,12280,"http://www.minhda.cl","Chile Ministry of Finance",2,"http://www.hacienda.cl/documentos.html",2,"http://sigfe.sigfe.cl",2,"http://sigfe.sigfe.cl/",1,"http://www.dipres.gob.cl/574/multipropertyvalues-15459-21327.html",0,0,"-",2,1,0,"-",1,"http://www.dipres.gob.cl/572/propertyvalue-15494.html",1,1,1989,0,null,"-","-",0,null,"-",1,2,1,2003,1,1,2003,1,1,0,0,0,1,1,1,1,0,0,"-",1,"http://datos.gob.cl",0,"-",1,"http://www.dipres.gob.cl/572/propertyvalue-15954.html",2,"http://www.ine.cl","Instituto Nacional de Estadísticas","http://www.bcentral.cl","Central Bank of Chile","http://www.dipres.gob.cl/572/channel.html",1,"http://creativecommons.org/licenses/by/3.0/cl/",1,"http://www.minhda.cl/documentos/leyes-y-normas.html",2,"-",0,3,"Availability of FAQs (Frequently Asked Questions), Twitter, Youtube","spa","eng","-","-",0,"SIGFE II","Sistema de Información para la Gestión Financiera del Estado","C","F",1,2007,"C",1,1,"LDSW > Oracle","Web","-","-","-","-","-","-","-","-","-","-","-","-","-","-",66,72,1,1,39,0.67689999999999995,0.75160000000000005,0.40010000000000001,0.87880000000000003,"LCR",null,"OECD","APEC",null,"Chile",3,null,2,null,1,0,null,null,null,null,null,17,65.384615384615387,"B",null,35,"Chile","CHL",2009,"<2",2009,15.1,233,2607.6982750000002]
[36,null,"China","UMIC",1344130,6643241.1275996398,4940,"http://www.mof.gov.cn","Ministry of Finance of the People's Republic of China",2,"http://yss.mof.gov.cn/",2,"http://www.bjcz.gov.cn/english/Golden%20Finance%20Project.htm",2,"http://www.mof.gov.cn/mofhome/gp/index.html",0,"-",0,0,"-",1,1,0,"-",1,"http://yss.mof.gov.cn/zhengwuxinxi/caizhengshuju/",1,1,2010,0,null,"-","-",0,null,"-",1,4,1,2003,0,null,"-",1,1,0,0,0,1,1,1,1,0,0,"-",1,"http://govinfo.nlc.gov.cn/",0,"-",1,"http://www.casc.gov.cn/kjfg/kjf/200607/t20060703_337029.htm",0,"http://www.stats.gov.cn","China National Bureau of Statistics","http://www.pbc.gov.cn","The People's Bank of China","-",1,"http://www.mof.gov.cn/zhengwuxinxi/gongkaimulu/zhengfuxinxigongkaiguiding/",1,"http://yss.mof.gov.cn/zhengwuxinxi/zhengceguizhang/",0,"Internal budget rules",0,3,"Online surveys also provided","chi","-","-","-","-","GFMIS","Government Financial Management Information System","C","F",2,2002,"C",1,1,"LDSW > Sybase","CS","-","-","-","-","-","-","-","-","-","-","-","-","-","-",11,13,null,0,78,0.53590000000000004,0.52939999999999998,0.3039,0.77449999999999997,"EAP",null,null,"APEC",null,"China",5,2,3,null,null,0,null,null,null,null,null,13,50,"B",null,36,"China","CHN",2009,11.8,2005,2.5,158607.34000000003,33603.25]
[37,null,"Colombia","UMIC",46927.125,284923.51438865036,6070,"http://www.minhacienda.gov.co","Colombia Ministry of Finance and Public Credit",2,"http://www.minhacienda.gov.co/HomeMinhacienda/elministerio/Presupuestal",2,"http://www.minhacienda.gov.co/HomeMinhacienda/SIIF",3,"http://www.pte.gov.co/",1,"http://www.pte.gov.co/Informes#",1,1,"http://www.pte.gov.co/Compromisos?",1,1,1,"http://www.pte.gov.co/",1,"http://www.minhacienda.gov.co/HomeMinhacienda/elministerio/InformacionContable",1,1,2000,1,1,4,2007,1,1,2007,1,1,1,2000,1,1,1995,1,1,0,0,0,1,1,1,1,1,0,"-",1,"http://datos.gov.co",1,"http://www.minhacienda.gov.co/HomeMinhacienda/asistenciaentidadesterritoriales",1,"http://www.minhacienda.gov.co/HomeMinhacienda/elministerio/InformacionContable/Info.ContableTesoroNal/2012",1,"http://www.dane.gov.co","Colombia National Administrative Department of Statistics (DANE) ","http://www.banrep.gov.co","Bank of the Republic","-",1,"http://www.pte.gov.co",1,"http://www.minhacienda.gov.co/HomeMinhacienda/elministerio/NormativaMinhacienda/2012",0,"National laws and regulations",0,3,"Availability of FAQs (Frequently Asked Questions), online chat also provided, twitter","spa","-","-","-","-","SIIF","Sistema Integrado de Información Financiera","C","F",2,2009,"C",2,1,"LDSW > MS SQL","Web","Jun 2009","Public","C","A","B","B+","NR","B","C+","A","B","NU",3.125,2.9629629629629628,58,61,1,2,43,0.65720000000000001,0.84309999999999996,0.28939999999999999,0.83909999999999996,"LCR",null,null,null,null,"Colombia",1,null,1,null,null,0,null,null,null,null,"2013-04-30",24,92.307692307692307,"A",null,37,"Colombia","COL",2010,8.1999999999999993,2011,34.1,3848.0242499999999,16002.149625000002]
[38,null,"Comoros","LIC",753.94299999999998,580.99270557354544,770,"http://www.beit-salam.km","Ministry of Finance, Budget, Economy and Planning",0,"-",1,"http://siteresources.worldbank.org/INTDEBTDEPT/PreliminaryDocuments/22539668/ComorosPD.pdf",0,"-",0,"-",0,0,"-",0,0,0,"-",0,"-",0,null,"-",0,null,"-","-",0,null,"-",0,null,null,"-",0,null,"-",0,0,0,0,0,0,0,0,0,0,0,"-",0,"-",0,"-",0,"-",0,"-","Direction de la Statistique","http://www.banque-comores.km","Central Bank of Comoros","-",0,"-",0,"-",0,"-",0,0,"-","fre","ara","-","-",0,"SIGFIP","Système Intégré de Gestion des Finances Publiques","C","F",3,2015,"C",1,0,"?","Web","Jan 2008","Final","X","X","X","X","X","X","X","X","X","X",1.4,1.4516129032258065,"-","-",null,1,171,0.23580000000000001,7.8399999999999997E-2,4.36E-2,0.58530000000000004,"AFR",null,null,null,"F","Comoros",0,null,null,null,null,0,null,null,null,null,null,1,3.8461538461538463,"D",null,38,"Comoros","COM",2004,46.1,2004,44.8,347.56772299999994,337.76646399999998]
[39,null,"Congo","LMIC",4139.7479999999996,9315.5497488248584,2250,"http://www.mefb-cg.org","Ministry of Economy, Finance, and Budget",1,"http://www.mefb-cg.org/loi_de_finances/lois_2010.html",1,"http://www.worldbank.org/ifa/rosc_aa_cgo_eng_0310.pdf",1,"-",0,"-",0,0,"-",1,1,0,"-",0,"-",0,null,"-",0,null,"-","-",0,null,"-",1,4,0,2005,0,null,"-",0,0,0,0,0,1,1,0,0,0,0,"-",0,"-",0,"-",0,"-",1,"http://www.cnsee.org","National Institute of Statistics","http://www.beac.int","Congo:  Bank of Central African States","-",0,"-",0,"-",0,"-",0,0,"-","fre","-","-","-","-","SYSCOHADA","OHADA Accounting System","C","T",1,2000,"C",1,1,"LDSW + OSS","Web","Mar 2006","Public","C","B","D","D+","D+","D","C+","D+","D","A",1.9,2,"-","-",null,1,157,0.28089999999999998,7.8399999999999997E-2,0.1275,0.63690000000000002,"AFR",null,null,null,"F","Congo",0,null,null,null,null,0,null,null,null,null,null,6,23.076923076923077,"D",null,39,"Congo","COG",2005,54.1,2011,46.5,2239.6036679999997,1924.9828199999997]
[40,null,"Congo, Dem. Rep.","LIC",67757.577000000005,13103.733450840975,190,"http://www.presidentrdc.cd","Ministry of Finance",0,"-",1,"http://ddp-ext.worldbank.org/EdStats/ZARper08a.pdf",0,"-",0,"-",0,0,"-",0,0,0,"-",0,"-",0,null,"-",0,null,"-","-",0,null,"-",0,null,null,"-",0,null,"-",0,0,0,0,0,0,0,0,0,0,0,"-",0,"-",0,"-",0,"-",2,"-"," ","http://www.beac.int","Congo:  Bank of Central African States","-",0,"-",0,"-",0,"-",0,0,"-","fre","-","-","-","-","MIS","Management Information System","C","T",3,2012,"C+L",1,0,"?","Web","Mar 2008","Public","A","B","D","D","C","D","C+","C+","D+","D+",2,1.6,18,6,null,1,174,0.22800000000000001,0.17649999999999999,1.83E-2,0.48930000000000001,"AFR",null,null,null,"F","Congo, Dem. Rep.",0,null,null,null,null,0,null,null,null,null,null,1,3.8461538461538463,"D",null,40,"Congo, Dem. Rep.","COD",2006,87.7,2005,71.3,59423.395029000007,48311.152400999999,null,2008]
[41,null,"Costa Rica","UMIC",4726.5749999999998,36114.030298751582,7640,"http://www.hacienda.go.cr","Costa Rica Ministry of Finance",1,"https://www.hacienda.go.cr/msib21/espanol/Miscelaneos/Indices/ge_informacionespecializada.htm?vnode=16",2,"https://www.hacienda.go.cr/Msib21/Espanol/Direccion+General+de+Informatica/SIGAF.htm",1,"-",1,"https://www.hacienda.go.cr/Msib21/Espanol/Secretaria+Tecnica+de+la+Autoridad+Presupuestaria/Ingresos+y+Gastos+Gobierno.htm",0,0,"-",1,1,0,"-",1,"https://www.hacienda.go.cr/Msib21/Espanol/Contabilidad+Nacional/Estructuraestadosfinancieros.htm",1,0,2003,1,0,5,2009,0,null,"-",1,4,1,2004,0,null,"-",1,1,0,0,0,1,1,0,1,0,0,"-",1,"http://www.gobiernofacil.go.cr/e-gob/weblinks/index.aspx",0,"-",0,"-",2,"http://www.inec.go.cr","Costa Rica Instituto Nacional de Estadística y Censos","http://www.bccr.fi.cr","Central Bank of Costa Rica","https://www.hacienda.go.cr/msib21/espanol/Miscelaneos/Indices/ge_informacionespecializada.htm?vnode=16",0,"-",1,"https://www.hacienda.go.cr/msib21/espanol/Acerca%20del%20Ministerio/InformaciondelMinisterio.htm",2,"National laws and regulations",0,1,"-","spa","-","-","-","-","SFP + SIGAF","Sistema de Formulación / Sistema Integrado de Gestión para la Administración Financiera","C","F",1,2007,"C+L",1,2,"MS SQL + SAP","Web","Oct 2010","Public","A","A","B","C+","A","B","B+","C+","B+","C",3.2,3.1774193548387095,50,47,1,0,77,0.53969999999999996,0.49669999999999997,0.3135,0.80889999999999995,"LCR",null,null,null,null,"Costa Rica",2,null,null,2,null,0,null,null,null,null,null,12,46.153846153846153,"C",null,41,"Costa Rica","CRI",2009,3.1,2011,24.8,146.52382499999999,1172.1905999999999]
[42,null,"Côte d'Ivoire","LMIC",20152.894,22064.566053897823,1090,"http://www.finances.gouv.ci","Côte d'Ivoire Ministry of Economy & Finance",1,"http://www.finances.gouv.ci/index.php/fr/elements-de-gouvernance/execution-budgetaire.html",2,"http://www.sndi.ci/index.php/component/content/article/78.html",1,"-",0,"-",0,0,"-",1,1,0,"-",1,"http://www.tresor.gov.ci/reformes/instructions-comptables/instructions-comptables-2011.html",0,null,"-",1,0,3,2011,0,null,"-",1,3,1,2008,1,1,1999,0,1,0,0,0,1,1,0,0,0,1,"http://www.dmp.finances.gouv.ci/",0,"-",0,"-",0,"-",0,"http://www.ins.ci","Côte d'Ivoire Institut national de la statistique (INS)","http://www.bceao.int ","Central Bank of West African States (BCEAO)","-",0,"-",1,"http://www.finances.gouv.ci/index.php/fr/ministere/grandes-directions.html",0,"-",0,3,"-","fre","-","-","-","-","ASTER/SIGFIP","Application des Services du Trésor en Réseau / Système Intégré de Gestion des Finances Publiques","C","T",1,1999,"C",1,1,"LDSW","CS","Nov 2008","Public","B","C","C","D","C+","D","D+","C+","D","D+",1.8,1.7777777777777777,"-","-",null,0,166,0.25800000000000001,0.33329999999999999,0.1019,0.33879999999999999,"AFR",null,null,null,"F","Côte d'Ivoire",0,null,null,null,null,0,null,null,null,null,null,12,46.153846153846153,"C",null,42,"Côte d'Ivoire","CIV",2008,23.8,2008,42.7,4796.3887720000002,8605.2857380000005,null,2014]
[43,null,"Croatia","HIC",4407,59617.667212374159,13530,"http://www.mfin.hr","Croatia Ministry of Finance",2,"http://www.mfin.hr/hr/proracun",1,"http://www.mfin.hr/adminmax/docs/strategija2007_eng.pdf",1,"-",1,"http://www.mfin.hr/hr/drzavni-proracun-2013-godina",0,0,"-",1,1,0,"-",1,"http://www.mfin.hr/hr/drzavni-proracun-arhiva",1,1,1998,1,1,3,2010,0,null,"-",1,4,1,1998,0,null,"-",1,1,0,0,0,1,1,0,1,1,0,"-",1,"http://www.mojauprava.hr",0,"-",1,"http://www.mfin.hr/hr/proracunsko-racunovodstvo",0,"http://www.dzs.hr","Croatia Central Bureau of Statistics","http://www.hnb.hr","Croatian National Bank","-",1,"http://www.mfin.hr/hr/odnosi-s-javnoscu",1,"http://www.mfin.hr/hr/zakonodavstvo?id=16&type=zakon",2,"National laws and regulations",0,3,"There is a provision for newsletter subscriptions","hrv","eng","-","-",0,"IFMIS","Integrated Financial Management Information System","D","F",1,2011,"C+L",1,2,"SAP","Web","-","-","-","-","-","-","-","-","-","-","-","-","-","-",61,57,1,2,30,0.73280000000000001,0.64049999999999996,0.69650000000000001,0.86150000000000004,"ECA",null,null,null,null,"Croatia",1,null,null,1,null,0,null,null,null,null,"2013-04-19",14,53.846153846153847,"B",null,43,"Croatia","HRV",2008,"<2",2004,11.1,3,489.17699999999996]
[44,null,"Cuba","UMIC",11253.665000000001,60810,5403.5729693393214,"http://www.mfp.cu","Cuba Ministry of Finance",1,"http://www.mfp.cu/docs/Ley%20Presupuesto%20Anual%202011.pdf",0,"-",1,"-",0,"-",0,0,"-",1,0,0,"-",0,"-",0,null,"-",0,null,"-","-",0,null,"-",0,null,null,"-",0,null,"-",0,0,0,0,0,0,0,0,0,0,0,"-",0,"-",0,"-",0,"-",0,"http://www.one.cu","Cuba Office of National Statistics","http://www.bc.gov.cu","Central Bank of Cuba","-",0,"-",0,"-",0,"-",0,1,"-","spa","-","-","-","-","-","-","C","-","-","-","-","-","-","-","-","-","-","-","-","-","-","-","-","-","-","-","-","-","-","-","-",null,"-",110,0.44879999999999998,0.30719999999999997,7.0900000000000005E-2,0.96840000000000004,null,"OTH",null,null,null,"Cuba",2,1,null,1,null,0,null,null,null,null,null,3,11.538461538461538,"D",null,44,"Cuba","CUB"]
[45,null,"Cyprus","HIC",1116.5640000000001,24690,22112.480789278536,"http://www.mof.gov.cy","Cyprus Ministry of Finance",2,"http://www.mof.gov.cy/mof/mof.nsf/page16_gr/page16_gr?OpenDocument",1,"http://www.treasury.gov.cy/treasury/treasury.nsf/financial_en/financial_en?OpenDocument",1,"-",0,"-",0,0,"-",1,1,0,"-",0,"-",1,1,2010,0,null,"-","-",0,null,"-",1,3,1,2004,1,1,2001,1,1,1,0,0,1,1,1,1,1,0,"-",1,"http://www.cyprus.gov.cy/portal/portal.nsf/citizen_en?OpenForm&access=0&SectionId=citizen&CategoryId=none&SelectionId=home&print=0&lang=en ",0,"-",0,"-",1,"http://www.cystat.gov.cy/mof/cystat/statistics.nsf/index_en/index_en?OpenDocument ","Cyprus Statistical Service of the Republic of Cyprus ","http://www.centralbank.gov.cy","Central Bank of Cyprus","-",1,"http://www.mof.gov.cy/mof/mof.nsf/disclaimer_gr/disclaimer_gr?OpenDocument",1,"http://www.mof.gov.cy/mof/mof.nsf/page07_gr/page07_gr?OpenDocument",0,"-",1,3,"-","gre","eng","-","-",0,"FIMAS","Financial Information and Management Accounting System ","C","F",1,2003,"C",1,2,"SAP","Web","-","-","-","-","-","-","-","-","-","-","-","-","-","-","-","-",null,0,45,0.65080000000000005,0.56210000000000004,0.51529999999999998,0.87509999999999999,null,"EU",null,null,null,"Cyprus",0,null,null,null,null,0,null,null,null,null,"2013-06-19",12,46.153846153846153,"C",null,45,"Cyprus","CYP"]
[46,null,"Czech Republic","HIC",10546,196323.5053196238,18620,"http://www.mfcr.cz","Ministry of Finance of the Czech Republic",2,"http://www.mfcr.cz/cps/rde/xchg/mfcr/xsl/fin_stat.html",2,"http://www.statnipokladna.cz/cs/KC-Zakladni-popis.html",1,"-",0,"-",0,0,"-",1,1,0,"-",1,"http://www.mfcr.cz/cps/rde/xchg/mfcr/xsl/plneni_stat_rozp.html",1,0,2003,1,1,3,2012,0,null,"-",1,2,0,2003,1,0,2010,1,1,0,0,0,1,1,1,1,0,0,"-",1,"http://www.opendata.cz",2,"http://www.statnipokladna.cz/cs/Podpora-Kompetencni-centrum-KC.html",1,"http://www.statnipokladna.cz/cs/Podpora-Kompetencni-centrum-KC.html",2,"http://www.czso.cz","Czech Statistical Office","http://www.cnb.cz","Czech National Bank","http://www.statnipokladna.cz/cs/",1,"http://www.mfcr.cz/cps/rde/xchg/mfcr/xsl/index_7661.html",1,"http://www.mfcr.cz/cps/rde/xchg/mfcr/xsl/zakon_o_sr.html",2,"Eurostat methodology. National laws and regulations.",0,3,"There is a provision for newsletter subscriptions","cze","eng","-","-",0,"IISSP","Integrovaného informačního systému Státní pokladny / State Treasury Integrated Information System","D","F",1,2011,"C+L",1,2,"SAP","Web","-","-","-","-","-","-","-","-","-","-","-","-","-","-",75,62,1,2,46,0.64910000000000001,0.54249999999999998,0.5151,0.88980000000000004,"ECA","EU","OECD",null,null,"Czech Republic",1,null,1,null,null,0,null,null,null,null,null,13,50,"B",null,46,"Czech Republic","CZE",1996,"<2"]
[47,null,"Denmark","HIC",5574,335102.50889877998,60120,"http://uk.fm.dk","Denmark Ministry of Finance",2,"http://uk.fm.dk/publications/",2,"http://www.oes.dk/Systemer/Navision-Stat",2,"http://www.oes-cs.dk/olapdatabase/regnskab/index.cgi",1,"http://www.oes-cs.dk/olapdatabase/regnskab/index.cgi",0,0,"-",2,1,0,"-",1,"http://fm.dk/publikationer/2010/budgetvejledning-2011/",1,1,1996,1,1,2,1998,0,null,"-",1,3,1,1996,0,null,"-",1,1,0,0,0,1,1,1,0,0,1,"http://www.peppol.eu/",1,"http://digitaliser.dk/resource/432461",0,"-",0,"-",1,"http://www.dst.dk","Statistics Denmark","http://www.nationalbanken.dk","National Bank of Denmark","http://www.digst.dk/",1,"http://fm.dk/om-os/privatlivspolitik/",1,"http://fm.dk/om-os/lov_-og-folketingsstof/",0,"National laws and regulations",1,3,"There is a provision for newsletter subscriptions","dan","eng","-","-",0,"FMIS","Financial Management Information System","D","F",1,1998,"C+L",1,2,"MS Navision","Web","-","-","-","-","-","-","-","-","-","-","-","-","-","-","-","-",1,3,4,0.88890000000000002,0.85619999999999996,0.86150000000000004,0.94889999999999997,null,"EU","OECD",null,null,"Denmark",5,1,3,null,1,1,1,null,null,null,null,17,65.384615384615387,"B",null,47,"Denmark","DNK"]
[48,null,"Djibouti","LMIC",905.56399999999996,1049,1158.3941057727561,"http://www.ministere-finances.dj","Djibouti Ministry of Finance",2,"http://www.ministere-finances.dj/TOFE.html",0,"-",1,"-",0,"-",0,0,"-",1,1,0,"-",1,"http://www.ministere-finances.dj/Publications/decr0224pr01.htm",1,1,1996,0,null,"-","-",1,1,2004,1,4,1,2006,0,null,"-",0,1,0,0,0,1,1,0,0,0,0,"-",0,"-",0,"-",1,"http://www.ministere-finances.dj/Publications/decr0224pr01.htm",1,"http://www.ministere-finances.dj","Djibouti Direction des statistiques et des études démographiques ","http://www.banque-centrale.dj","Central Bank of Djibouti","-",0,"-",1,"http://www.ministere-finances.dj/ORGANISATION.html",0,"-",0,3,"-","fre","eng","-","-",0,"-","-","C","-","-","-","-","-","-","-","-","-","-","-","-","-","-","-","-","-","-","-","-","-","-","-","-",null,0,176,0.2228,0.1961,4.8800000000000003E-2,0.42359999999999998,"MNA",null,null,null,null,"Djibouti",0,null,null,null,null,0,null,null,null,null,null,12,46.153846153846153,"C",null,48,"Djibouti","DJI",2002,18.8,null,null,170.24603200000001]
[49,null,"Dominica","UMIC",67.674999999999997,475.45866443590268,7030,"http://www.dominica.gov.dm/cms/index.php?q=node/28","Ministry of Finance",1,"http://www.dominica.gov.dm/cms/?q=node/7",1,"http://ddp-ext.worldbank.org/EdStats/DMAper05.pdf",1,"-",0,"-",0,0,"-",1,1,0,"-",1,"http://www.dominica.gov.dm/cms/?q=node/1402",1,1,2011,1,0,2,2010,0,null,"-",1,4,0,2009,1,1,2008,1,1,0,1,0,1,1,0,0,0,0,"-",0,"-",0,"-",0,"-",1,"http://www.dominica.gov.dm/cms/?q=node/7","Ministry of Finance - Central Statistical Office","http://www.eccb-centralbank.org","East Caribbean Central Bank","-",0,"-",1,"http://www.dominica.gov.dm/cms/index.php?q=node/411",0,"-",0,2,"-","eng","-","-","-","-","SIGFIS","Standardized Integrated Government Financial Information System","C","F",3,2012,"C+L",2,2,"SmartStream","Web","Jun 2010","Final","X","X","X","X","X","X","X","X","X","X",2.5499999999999998,2.5161290322580645,"-","-",null,1,73,0.55610000000000004,0.29409999999999997,0.62209999999999999,0.752,"LCR",null,null,null,null,"Dominica",0,null,null,null,null,0,null,null,null,null,null,12,46.153846153846153,"C",null,49,"Dominica","DMA"]
[50,null,"Dominican Republic","UMIC",10056.181,52646.788693078764,5240,"http://www.hacienda.gov.do","Dominican Republic Ministry of Finance",2,"http://www.digepres.gob.do/",2,"http://www.hacienda.gov.do/sigef/sigef.htm",1,"-",0,"-",1,1,"http://www.digepres.gob.do/LinkClick.aspx?fileticket=VkzSW7GtziU%3d&tabid=133&mid=576",1,1,2,"http://www.portaldelciudadano.gov.do/",1,"http://www.digepres.gob.do/Estad%c3%adsticasPresup/SeriesHist%c3%b3ricas199010/tabid/135/Default.aspx",1,1,1990,0,null,"-","-",1,0,2004,1,2,1,1990,0,null,"-",1,1,0,0,0,1,0,0,1,0,0,"-",1,"http://www.one.gob.do",0,"-",0,"-",0,"http://www.one.gob.do","Dominican Republic Oficina Nacional de Estadistica","http://www.bancentral.gov.do","Central Bank of the Dominican Republic","-",1,"http://www.digepres.gob.do/Inicio/tabid/36/ctl/Terms/Default.aspx",1,"http://www.hacienda.gov.do/transparencia/leyes_decretos.htm",0,"National laws and regulations",1,3,"-","spa","-","-","-","-","SIGEF","Sistema Integrado de Gestion Financiera","C","F",1,2004,"C+L",1,1,"LDSW > Oracle","Web","Nov 2012","Public","B","B","B","C+","B+","B","C+","C+","C+","C+",2.8,2.4500000000000002,29,14,1,0,89,0.51300000000000001,0.53590000000000004,0.26319999999999999,0.73980000000000001,"LCR",null,null,null,null,"Dominican Republic",0,null,null,null,null,0,null,null,null,null,null,17,65.384615384615387,"B",null,50,"Dominican Republic","DOM",2010,2.2000000000000002,2011,40.4,221.23598200000004,4062.6971240000003]
[51,null,"Ecuador","UMIC",14666.055,61651.763916788332,4200,"http://finanzas.gob.ec","Ecuador Ministry of Economy and Finance",2,"http://www.finanzas.gob.ec/estados-financieros/",2,"http://integrador.finanzas.gob.ec/sigefWebConsulta2011/Jsp/LoginPage.jsp;jsessionid=1FFD43DE0BF758EB3ADD163C29CE3C52",2,"http://gpr.informatica.gob.ec/gpr_ecuador/n1",0,"-",1,1,"http://www.finanzas.gob.ec/wp-content/uploads/downloads/2012/09/Reporte+de+Ingresos.pdf",2,1,1,"http://www.secretariatransparencia.gob.ec/",0,"-",1,1,2004,1,0,4,2012,1,1,2006,1,2,1,2004,1,1,2006,1,1,0,0,0,1,1,0,1,0,1,"http://www.compraspublicas.gob.ec/compraspublicas/",1,"http://www.gobiernoelectronico.gov.ec",0,"-",0,"-",2,"http://www.inec.gov.ec","Ecuador Instituto Nacional de Estadística y Censos","http://www.bce.fin.ec ","Central Bank of Ecuador","http://www.bce.fin.ec/contenido.php?CNT=ARB0000003",1,"http://www.finanzas.gob.ec/transparencia/",0,"-",0,"-",0,0,"-","spa","eng","-","-",0,"SIGEF","Sistema Integrado de Gestion Financiera","C","F",1,2008,"C+L",2,1,"LDSW > Oracle","Web","Mar 2010","Draft","X","X","X","X","X","X","X","X","X","X",1.9,2.370967741935484,31,31,null,0,102,0.4869,0.45750000000000002,0.2482,0.75490000000000002,"LCR",null,null,null,null,"Ecuador",1,null,null,null,1,0,null,null,null,null,null,21,80.769230769230774,"A",null,51,"Ecuador","ECU",2010,4.5999999999999996,2011,28.6,674.63853000000006,4194.4917299999997]
[52,null,"Egypt","LMIC",82536.77,214683.55955663044,2600,"http://www.mof.gov.eg","Egypt Ministry of Finance",2,"http://www.mof.gov.eg/English/Papers_and_Studies/Pages/The-State-Budget.aspx",1,"http://www.mof.gov.eg/MOFGallerySource/English/Reports/December2004.pdf",1,"-",0,"-",0,0,"-",2,1,0,"-",1,"http://www.mof.gov.eg/English/Papers_and_Studies/Pages/budget11-12.aspx",0,null,"-",0,null,"-","-",0,null,"-",1,4,1,2006,0,null,"-",0,1,1,1,0,1,1,1,0,0,0,"-",0,"-",0,"-",1,"http://www.mof.gov.eg/English/Papers_and_Studies/Pages/The-State-Budget.aspx",0,"http://www.capmas.gov.eg","Egypt Central Agency for Public Mobilization and Statistics","http://www.cbe.org.eg","Central Bank of Egypt","-",0,"-",1,"http://www.mof.gov.eg/English/About%20MOF/Pages/MinistryGoals.aspx",0,"-",0,3,"-","ara","eng","-","-",0,"AGES / GFMIS","Automated Government Expenditure System","C","F",3,2012,"C",1,2,"Oracle","Web","Oct 2009","Final","X","X","X","X","X","X","X","X","X","X",2.5,2.4464285714285716,13,49,null,0,107,0.46110000000000001,0.60129999999999995,0.22320000000000001,0.55879999999999996,"MNA",null,null,null,"F","Egypt",0,null,null,null,null,0,null,null,null,null,null,10,38.461538461538467,"C",null,52,"Egypt","EGY",2008,"<2",2008,22,1395,18158.089400000001]
[53,null,"El Salvador","LMIC",6227.491,21670.423333830084,3480,"http://www.mh.gob.sv","El Salvador Ministry of Finance",2,"http://www.mh.gob.sv/portal/page/portal/PTF/Presupuestos_Publicos",1,"http://www.mh.gob.sv/portal/page/portal/PMH/Novedades/Calendario/Capacitaciones:Capacitaciones_2012:safi2012",2,"http://www.transparenciafiscal.gob.sv/portal/page/portal/PTF/Consulte_nuestra_Base_de_Datos/ConsulteNuestraBaseDeDatosEjecucionPresupuesto",1,"http://www.transparenciafiscal.gob.sv/portal/page/portal/PTF/Consulte_nuestra_Base_de_Datos/ConsulteNuestraBaseDeDatosEjecucionPresupuesto",1,1,"http://www.transparenciafiscal.gob.sv/CT_proyectos/htdocs/tabla/ejecucion.jsp",2,1,2,"http://www.transparenciafiscal.gob.sv/portal/page/portal/PTF/Presupuestos_Publicos",1,"http://www.transparenciafiscal.gob.sv/portal/page/portal/PTF/Marco_Normativo/Administracion_Financiera?_piref496_2086330_496_2086268_2086268.tabstring=catalogo",1,1,2002,1,1,5,2010,1,1,2004,1,2,1,2002,0,null,"-",1,1,0,0,0,1,1,1,1,1,1,"http://www.comprasal.gob.sv/moddiv/HTML/",1,"http://www.gobiernoabierto.gob.sv/",0,"-",1,"http://www.transparenciafiscal.gob.sv/portal/page/portal/PTF/Marco_Normativo/Administracion_Financiera?_piref496_2086330_496_2086268_2086268.tabstring=catalogo",1,"http://www.minec.gob.sv","El Salvador General Directorate of Statistics and Censuses ","http://www.bcr.gob.sv","Central Reserve Bank of El Salvador","-",1,"http://www.mh.gob.sv/portal/page/portal/PMH/LAIP",1,"http://www.mh.gob.sv/portal/page/portal/PMH/Institucion/Estructura_Organizativa/Organigrama_del_Ministerio_de_Hacienda",0,"-",0,3,"-","spa","eng","-","-",0,"SAFI II","Sistema de Administración Financiera Integrado","C","F",3,2001,"C+L",2,1,"LDSW > Informix","CS","May 2009","Public","C","A","B","C+","B+","B","B+","A","C+","D",2.9,2.967741935483871,43,37,1,0,74,0.55130000000000001,0.67320000000000002,0.26379999999999998,0.71689999999999998,"LCR",null,null,null,null,"El Salvador",0,null,null,null,null,0,null,null,null,null,"2013-05-02",22,84.615384615384613,"A",null,53,"El Salvador","SLV",2009,9,2010,42.5,560.47419000000002,2646.6836749999998]
[54,null,"Equatorial Guinea","HIC",720.21299999999997,11287.654871035402,15670,"http://www.guineaecuatorialpress.com/noticia.php?id=126&lang=en","Equatorial Guinea Ministry of Finance & Budget",0,"-",0,"-",0,"-",0,"-",0,0,"-",0,0,0,"-",0,"-",0,null,"-",0,null,"-","-",0,null,"-",0,null,null,"-",0,null,"-",0,0,0,0,0,0,0,0,0,0,0,"-",0,"-",0,"-",0,"-",0,"http://www.dgecnstat-ge.org","Equatorial Guinea Direction Générale des Statistiques","http://www.beac.int ","Bank of Central African States","-",0,"-",0,"-",0,"-",0,1,"-","spa","eng","-","-",0,"-","-","C","-","-","-","-","-","-","-","-","-","-","-","-","-","-","-","-","-","-","-","-","-","-",0,0,null,1,151,0.29549999999999998,9.8000000000000004E-2,8.8300000000000003E-2,0.70009999999999994,"AFR",null,null,null,null,"Equatorial Guinea",0,null,null,null,null,0,null,null,null,null,null,0,0,"D",null,54,"Equatorial Guinea","GNQ",null,null,2006,76.8,null,553.12358399999994]
[55,null,"Eritrea","LIC",5415.28,2313.0604519744402,430,"http://www.shabait.com","Ministry of Finance",0,"-",0,"-",0,"-",0,"-",0,0,"-",0,0,0,"-",0,"-",0,null,"-",0,null,"-","-",0,null,"-",0,null,null,"-",0,null,"-",0,0,0,0,0,0,0,0,0,0,0,"-",0,"-",0,"-",0,"-",0,"-","Ministry of Natl Dev - Statistics Dept","http://www.boe.gov.er","Bank of Eritrea","-",0,"-",0,"-",0,"-",0,1,"-","ara","-","-","-","-","-","-","C","-","-","-","-","-","-","-","-","-","-","-","-","-","-","-","-","-","-","-","-","-","-","-","-",null,0,180,0.20430000000000001,0.2092,1.32E-2,0.39069999999999999,"AFR",null,null,null,"F","Eritrea",0,null,null,null,null,0,null,null,null,null,null,0,0,"D",null,55,"Eritrea","ERI"]
[56,null,"Estonia","HIC",1340,20447.947864508893,15260,"http://www.fin.ee","Eesti Vabarigiigi Rahandusministeerium - Ministry of Finance, Estonia",2,"http://www.fin.ee/riigieelarve",1,"http://www.mindware.ee/en/Portfolio/Finance-and-Insurance",2,"http://pub.stat.ee/px-web.2001/Database/Majandus/14Rahandus/08Valitsemissektori_rahandus/08Valitsemissektori_tulud_kulud/08Valitsemissektori_tulud_kulud.asp",1,"http://www.fin.ee/riigieelarve-2011",0,0,"-",2,1,0,"-",1,"http://www.fin.ee/index.php?id=7544",1,1,2008,1,1,4,2003,0,null,"-",1,2,1,1995,1,0,2005,1,1,1,0,0,1,1,1,1,1,1,"https://riigihanked.riik.ee/lr1/web/guest/index",1,"http://pub.stat.ee/px-web.2001/Dialog/statfile1.asp",0,"-",1,"http://www.fin.ee/index.php?id=79938",0,"http://www.stat.ee","Statistical Office of Estonia ","http://www.bankofestonia.info","Bank of Estonia","-",0,"-",1,"http://www.fin.ee/index.php?id=243",2,"-",0,3,"-","est","eng","rus","-",0,"FMIS","Financial Management Information System","C","F",1,2001,"C+L",1,2,"SAP","Web","-","-","-","-","-","-","-","-","-","-","-","-","-","-","-","-",1,2,20,0.79869999999999997,0.82350000000000001,0.66420000000000001,0.90849999999999997,"ECA","EU","OECD",null,null,"Estonia",0,null,null,null,null,0,null,null,null,null,null,17,65.384615384615387,"B",null,56,"Estonia","EST",2004,"<2"]
[57,null,"Ethiopia","LIC",84734.262000000002,30963.634534093431,370,"http://www.mofed.gov.et","Ethiopia Ministry of Finance and Economic Development",2,"http://www.mofed.gov.et/English/Resources/Pages/ResourcesByTopic.aspx",1,"http://www.hks.harvard.edu/m-rcbg/ethiopia/Publications/ARD%20Final%20Draft.pdf",1,"-",0,"-",0,0,"-",1,1,0,"-",0,"-",0,null,"-",1,0,5,2010,0,null,"-",1,4,0,2001,0,null,"-",0,1,1,1,1,1,1,1,0,0,1,"http://www.ppa.gov.et/",0,"-",0,"-",0,"-",1,"http://www.csa.gov.et","Central Statistics Agency of Ethiopia","http://www.nbe.gov.et ","National Bank of Ethiopia","-",1,"http://www.mofed.gov.et/English/Pages/Accessibility.aspx",1,"http://www.mofed.gov.et/English/Information/Pages/OrganizationalStructure.aspx",0,"-",0,3,"-","eng","amh","tig","afo",0,"IBEX","Integrated Budget and Expenditure System","C","F",1,2007,"C",1,1,"LDSW > MS Access","CS","Sep 2010","Public","B","A","C","C","B+","NU","B+","C+","C+","C",2.7777777777777777,2.8571428571428572,"-","-",null,1,172,0.2306,0.47060000000000002,9.2999999999999992E-3,0.21190000000000001,"AFR",null,null,null,null,"Ethiopia",0,null,null,null,null,0,null,null,null,null,null,8,30.76923076923077,"C",null,57,"Ethiopia","ETH",2011,30.7,2011,29.6,26013.418434000003,25081.341552000005,null,2006]
[58,null,"Fiji","LMIC",868.40599999999995,3231.4199546465802,3720,"http://www.finance.gov.fj","Fiji Ministry of Finance",2,"http://www.finance.gov.fj/s.html",1,"http://www.finance.gov.fj/index.php?option=com_content&view=article&id=17&Itemid=37",1,"-",0,"-",0,0,"-",2,1,0,"-",0,"-",0,null,"-",1,1,3,2004,0,null,"-",1,4,1,2009,0,null,"-",0,1,0,0,0,1,1,0,1,0,0,"-",0,"-",0,"-",0,"-",1,"http://www.statsfiji.gov.fj","Fiji Statistics Bureau ","http://www.reservebank.gov.fj","Reserve Bank of Fiji","-",1,"http://www.fiji.gov.fj/index.php?option=com_content&view=article&id=583:accessiblity&catid=80",0,"-",0,"-",0,3,"-","eng","-","-","-","-","FMIS","Financial Management Information System","C","F",1,2008,"C+L",1,2,"Infor FMS","Web","Jun 2005","Final","X","X","X","X","X","X","X","X","X","X",1.85,1.9193548387096775,6,0,null,1,105,0.4672,0.35949999999999999,0.24340000000000001,0.79859999999999998,"EAP",null,null,null,null,"Fiji",0,null,null,null,null,0,null,null,null,null,null,11,42.307692307692307,"C",null,58,"Fiji","FJI",2009,5.9,2009,31,51.235954,269.20585999999997]
[59,null,"Finland","HIC",5387,257342.8030655185,47770,"http://www.vm.fi/vm/fi/01_etusivu","Valtioneuvosto - Ministry of Finance, Finland",2,"http://www.vm.fi/vm/fi/04_julkaisut_ja_asiakirjat/01_julkaisut/01_budjetit/index.jsp",2,"http://www.valtiokonttori.fi/fi-FI/Virastoille_ja_laitoksille/Kiekun_kayttoonotto_valtionhallinnossa",3,"http://www.netra.fi",1,"http://www.netra.fi",0,0,"-",1,1,0,"-",1,"http://www.vm.fi/vm/fi/04_julkaisut_ja_asiakirjat/03_muut_asiakirjat/24229/24230_fi.pdf",1,1,2002,1,1,4,2004,0,null,"-",1,4,1,2001,1,1,2001,1,1,0,1,0,1,1,1,1,0,1,"http://www.peppol.eu/",1,"http://www.suomi.fi/suomifi/tyohuone/yhteiset_palvelut/avoin_data",0,"-",0,"http://www.vm.fi/vm/en/15_municipal_affairs/01_legislation/07_act/index.jsp",2,"http://www.stat.fi","Statistics Finland","http://www.bof.fi","Bank of Finland ","http://www.valtiokonttori.fi",0,"-",1,"http://www.vm.fi/vm/en/02_ministry/index.jsp",2,"GFS 2001 + National laws and regulations",0,1,"-","fin","swe","eng","-",0,"KIEKU","Government Financial and HR Administration System","D","F",1,2011,"C",1,2,"SAP + Logica","Web","-","-","-","-","-","-","-","-","-","-","-","-","-","-","-","-",1,3,9,0.85050000000000003,0.88239999999999996,0.72250000000000003,0.94669999999999999,null,"EU","OECD",null,null,"Finland",4,1,2,1,null,1,1,null,null,null,"2013-04-04",19,73.076923076923066,"B",null,59,"Finland","FIN"]
[60,null,"France","HIC",65436.552000000003,2775664.2076101578,42420,"http://www.economie.gouv.fr","France Ministre du Budget, des Comptes publics, de la Fonction publique et de la Réforme de l'État",2,"http://www.performance-publique.budget.gouv.fr/",2,"http://www.performance-publique.budget.gouv.fr/la-gestion-publique/la-gestion-budgetaire/approfondir/les-systemes-dinformation-financiere-de-letat/chorus-loutil-de-gestion-financiere-budgetaire-et-comptable-en-mode-lolf-deploiement-acheve-au-1er-janvier-2011.html",1,"-",0,"-",0,0,"-",2,1,1,"http://www.cyber-budget.fr",1,"http://www.performance-publique.budget.gouv.fr/la-gestion-publique/la-gestion-budgetaire/lessentiel/les-nomenclatures-du-budget-de-letat-une-meilleure-identification-des-engagements-et-des-depenses.html",1,1,2004,1,1,3,2008,0,null,"-",1,4,1,2006,1,1,2004,1,1,0,0,0,1,1,0,1,0,1,"http://www.peppol.eu/",1,"http://data.gouv.fr",0,"-",0,"-",3,"http://www.insee.fr","National Institute of Statistics and Economic Studies (INSEE)","http://www.banque-france.fr","Bank of France","http://www.aft.gouv.fr/articles/2005-draft-budget-bill_872.html",1,"http://www.budget.gouv.fr/budget/accessibilite",1,"http://www.economie.gouv.fr/le-ministere/services-ministere-leconomie-et-des-finances",0,"-",0,1,"-","fre","-","-","-","-","CHORUS","Government Financial Information System","C","F",1,2011,"C+L",1,2,"SAP","Web","-","-","-","-","-","-","-","-","-","-","-","-","-","-",83,87,null,3,6,0.86350000000000005,0.87580000000000002,0.79020000000000001,0.9244,null,"EU","OECD",null,null,"France",12,6,2,3,1,5,1,1,2,1,null,18,69.230769230769226,"B",null,60,"France","FRA"]
[61,null,"Gabon","UMIC",1534.2619999999999,12397.299627471075,8080,"http://www.finances.gouv.ga","Gabon Ministère du Budget, des Comptes Publics, de la Fonction Publique, Charge de la Réforme de l'État",2,"http://www.finances.gouv.ga/budget/rubrique.php3?id_rubrique=110",1,"http://ddp-ext.worldbank.org/EdStats/GABpemfar06.pdf",1,"-",0,"-",0,0,"-",2,1,0,"-",1,"http://www.finances.gouv.ga/budget/IMG/pdf/DGB_Nom_Guide_2007.pdf",1,0,2001,0,null,"-","-",1,1,2000,1,4,1,2000,0,null,"-",0,1,1,1,1,1,0,1,0,0,0,"-",0,"-",0,"-",1,"http://www.finances.gouv.ga/budget/IMG/pdf/DGB_Nom_Guide_2007.pdf",1,"http://www.stat-gabon.org","Gabon Direction générale de la statistique et des études économiques (DGSEE)","http://www.beac.int ","Bank of Central African States","-",0,"-",1,"http://www.finances.gouv.ga/budget/rubrique.php3?id_rubrique=187",2,"-",0,0,"-","fre","-","-","-","-","ASTER/SIGFIP","Application des Services du Trésor en Réseau / Système Intégré de Gestion des Finances Publiques","C","T",1,1999,"C",1,1,"LDSW > Oracle","CS","Sep 2006","Public","C","C","C","D","D","NU","C","C","B","NU",1.875,1.9565217391304348,"-","-",null,0,129,0.36870000000000003,0.1895,0.1595,0.75719999999999998,"AFR",null,null,null,null,"Gabon",0,null,null,null,null,0,null,null,null,null,null,13,50,"B",null,61,"Gabon","GAB",2005,4.8,2005,32.700000000000003,73.644576000000001,501.70367400000003]
[62,null,"Gambia","LIC",1776.1030000000001,889.2791724548938,500,"http://www.mofea.gov.gm","The Gambia Ministry of Finance and Economic Affairs ",2,"http://www.mofea.gov.gm/index.php?option=com_content&view=article&id=16&Itemid=24",2,"http://www.mofea.gov.gm/index.php?option=com_content&view=article&id=10&Itemid=13",1,"-",0,"-",1,1,"http://www.mofea.gov.gm/index.php?option=com_content&view=article&id=16&Itemid=24",1,1,0,"-",0,"-",0,null,"-",0,null,"-","-",0,null,"-",1,2,1,2011,0,null,"-",0,1,0,0,0,1,1,0,0,0,0,"-",0,"-",0,"-",0,"-",0,"http://www.gbos.gm","The Gambia Central Statistics Department","http://www.cbg.gm","Central Bank of The Gambia","-",0,"-",1,"http://www.mofea.gov.gm/index.php?option=com_content&view=article&id=17&Itemid=20",0,"-",0,3,"-","eng","-","-","-","-","IFMIS","Integrated Financial Management Information System","C","F",3,2007,"C",1,2,"Epicor","CS","Mar 2009","Draft","X","X","X","X","X","X","X","X","X","X",1.8888888888888888,2.06,"-","-",null,0,161,0.26879999999999998,0.32029999999999997,0.13439999999999999,0.35189999999999999,"AFR",null,null,null,null,"Gambia",0,null,null,null,null,0,null,null,null,null,null,11,42.307692307692307,"C",null,62,"Gambia","GMB",2003,29.8,2010,48.4,529.27869400000009,859.63385200000005]
[63,null,"Georgia","LMIC",4486,12848.997206086504,2860,"http://www.mof.ge","Ministry of Finance of Georgia",2,"http://www.mof.ge/4905",2,"http://fas.ge/en/Completed",2,"http://treasury.gov.ge/4960",0,"-",0,0,"-",2,1,1,"http://www.mof.ge/common/get_doc.aspx?doc_id=8983",1,"http://www.mof.ge/show_law.aspx?id=647",1,1,2004,1,1,4,2006,1,1,2012,1,2,1,2004,0,null,"-",1,1,1,0,0,1,1,1,0,1,0,"-",0,"-",0,"-",0,"-",3,"http://www.geostat.ge/index.php?action=0&lang=geo","Georgia State Department for Statistics ","http://www.nbg.gov.ge","National Bank of Georgia","http://treasury.gov.ge/en/40",0,"-",0,"-",2,"GFS 2001",0,0,"-","geo","eng","-","-",0,"PFMIS","Public Financial Management Information System","C","F",3,2013,"C+L",1,1,"LDSW > Oracle","Web","Nov 2008","Public","B","A","B","C+","A","D","B+","D+","D+","C",2.6,2.6333333333333333,55,55,1,2,72,0.55630000000000002,0.60129999999999995,0.23280000000000001,0.83479999999999999,"ECA",null,null,null,"F","Georgia",0,null,null,null,null,0,null,null,null,null,null,19,73.076923076923066,"B",null,63,"Georgia","GEO",2010,18,2009,24.7,807.48,1108.0419999999999,null,null,"DAD"]
[64,null,"Germany","HIC",81726,3617712.8627064456,44270,"http://www.bundesfinanzministerium.de","Bundesministerium der Finanzen",2,"http://www.bundesfinanzministerium.de",2,"http://www.zivit.de/DE/ITLoesungen/Haushaltsverfahren/Haushaltsverfahren_node.html",3,"www.bundeshaushalt-info.de",1,"http://www.bundeshaushalt-info.de/download.html",0,0,"-",2,1,1,"http://www.finanzforscher.de/",1,"http://www.bundesfinanzministerium.de/Content/DE/Standardartikel/Themen/Oeffentliche_Finanzen/Bundeshaushalt/Haushaltsrecht_und_Haushaltssystematik/das-system-der-oeffentlichen-haushalte-anl.pdf?__blob=publicationFile&v=2",1,1,2006,1,1,5,2006,0,null,"-",1,2,1,2004,1,1,2000,1,1,1,1,1,1,1,0,1,0,1,"http://www.peppol.eu/",1,"https://www.govdata.de/",0,"-",0,"-",1,"http://www.destatis.de","Germany Federal Statistical Office","http://www.bundesbank.de","Deutsche Bundesbank ","-",1,"http://www.bfdi.bund.de/cae/servlet/contentblob/412040/publicationFile/24681/TextIFG_EN.pdf",1,"http://www.bundesfinanzministerium.de/Web/DE/Service/Gesetze/gesetze.html",0,"European System of National Accounts - ESA 95",0,2,"BMF Application, Twitter, Facebook","ger","fre","eng","-",0,"HKR","Haushalts, Kassen und Rechnungswesen ","D","F",1,1999,"C+L",1,2,"SAP","Web","-","-","-","-","-","-","-","-","-","-","-","-","-","-",71,68,null,1,17,0.80789999999999995,0.75160000000000005,0.77500000000000002,0.89710000000000001,null,"EU","OECD",null,null,"Germany",7,1,3,3,null,6,null,null,5,1,null,21,80.769230769230774,"A",null,64,"Germany","DEU"]
[65,null,"Ghana","LMIC",24965.815999999999,35109.949998869954,1410,"http://www.mofep.gov.gh","Ghana Ministry of Finance and Economic Planning",2,"http://www.mofep.gov.gh/?q=budget-statements",2,"http://www.cagd.gov.gh/gifmis/index.php?option=com_content&view=article&id=28&Itemid=2&showall=1",1,"-",0,"-",0,0,"-",2,1,1,"http://www.mofep.gov.gh/?q=publications/150708",1,"http://cagd.gov.gh/portal/index.php?option=com_content&view=article&id=47&Itemid=48",1,1,1998,1,1,3,1999,0,null,"-",1,2,0,2008,1,0,2009,1,1,0,0,0,1,1,1,1,0,0,"-",1,"http://data.gov.gh",0,"-",1,"http://cagd.gov.gh/portal/index.php?option=com_content&view=article&id=47&Itemid=48&limitstart=1",0,"http://www.statsghana.gov.gh","Ghana Statistical Service ","http://www.bog.gov.gh","Bank of Ghana","-",0,"-",0,"-",2,"-",0,1,"-","eng","-","-","-","-","GIFMIS","Government Integrated Financial Management Information System","C","F",3,2013,"C",1,2,"Oracle","CS","Jan 2010","Public","C","B","A","C+","C","B","C+","C+","C+","C+",2.65,2.4166666666666665,50,54,1,2,145,0.31590000000000001,0.30070000000000002,0.1111,0.53600000000000003,"AFR",null,null,null,null,"Ghana",1,null,1,null,null,0,null,null,null,null,"2013-05-03",{"$f":"J67+L67+N67+P67+R67+S67+U67+V67+W67+Y67+AA67+AB67+AD67+AE67+AH67+AI67+AK67+AM67+AO67+AP67","v":16},61.53846153846154,"B",null,65,"Ghana","GHA",2006,28.6,2006,28.5,7140.2233759999999,7115.2575599999991]
[66,null,"Greece","HIC",11304,276747.99507922638,24480,"http://www.minfin.gr","Ministry of Finance",2,"http://www.minfin.gr/portal/el/resource/contentObject/contentTypes/genericContentResourceObject,fileResourceObject,arrayOfFileResourceTypeObject/topicNames/budget/resourceRepresentationTemplate/contentObjectListAlternativeTemplate",0,"-",1,"-",0,"-",0,0,"-",2,1,0,"-",1,"http://www.minfin.gr/portal/el/resource/contentObject/contentTypes/genericContentResourceObject,fileResourceObject,arrayOfFileResourceTypeObject/topicNames/budget/pageNumber/2/resourceRepresentationTemplate/contentObjectListAlternativeTemplate",1,1,2000,1,0,4,2012,0,null,"-",1,2,0,2010,0,null,"-",1,1,0,0,0,1,0,1,1,1,1,"http://www.peppol.eu/",1,"http://geodata.gov.gr/geodata",0,"-",0,"-",0,"http://www.statistics.gr","Greece National Statistical Service ","http://www.bankofgreece.gr","Bank of Greece","-",0,"-",1,"http://www.minfin.gr/portal/en/resource/contentObject/contentTypes/genericContentResourceObject,fileResourceObject,arrayOfFileResourceTypeObject/topicNames/actOfLaw/resourceRepresentationTemplate/contentObjectListAlternativeTemplate#fragment-2",2,"National laws and regulations",0,3,"-","gre","eng","-","-",0,"-","-","C","-","-","-","-","-","-","-","-","-","-","-","-","-","-","-","-","-","-","-","-","-","-","-","-",1,1,37,0.68720000000000003,0.57520000000000004,0.55310000000000004,0.93320000000000003,null,"EU","OECD",null,null,{"$f":"C68","v":"Greece"},{"$f":"SUM(DS68:DV68)","v":0},null,null,null,null,{"$f":"SUM(DX68:EA68)","v":0},null,null,null,null,null,11,{"$f":"EC68/26*100","v":42.307692307692307},{"$f":"IF(ED68<25,\"D\",IF(ED68<50,\"C\",IF(ED68<75,\"B\",\"A\")))","v":"C"},null,66,"Greece","GRC"]
[67,null,"Grenada","UMIC",104.89,770.89636336087574,7350,"http://www.gov.gd/ministries/finance.html","Ministry of Finance, Planning, Economy, Energy & Cooperatives",2,"http://www.gov.gd/documents.html",1,"http://ec.europa.eu/europeaid/what/economic-support/public-finance/documents/grenada_pefa_report_en.pdf",1,"-",0,"-",0,0,"-",1,1,0,"-",0,"-",1,1,2003,0,null,"-","-",0,null,"-",0,null,null,"-",1,0,2006,1,1,0,0,0,1,1,0,0,0,0,"-",0,"-",0,"-",0,"-",0,"-","MoF, Central Statistics Office","http://www.eccb-centralbank.org","East Caribbean Central Bank","-",0,"-",1,"http://www.gov.gd/ministries/finance.html",0,"-",0,3,"Facebook, Twitter, Youtube, VIMEO","eng","-","-","-","-","SIGFIS","Standard Integrated Government Financial Information System","C","F",3,2012,"C+L",2,2,"SmartStream","Web","Mar 2010","Public","C","A","B","C","B","D","C+","C+","B+","D",2.4500000000000002,2.2166666666666668,"-","-",null,0,75,0.54790000000000005,0.35289999999999999,0.40139999999999998,0.88949999999999996,"LCR",null,null,null,null,"Grenada",0,null,null,null,null,0,null,null,null,null,null,9,34.615384615384613,"C",null,67,"Grenada","GRD"]
[68,null,"Guatemala","LMIC",14757.316000000001,42358.507991845676,2870,"http://www.minfin.gob.gt","Guatemala Ministry of Public Finance",2,"http://www.minfin.gob.gt/",2,"http://www.minfin.gob.gt/frame.php?url=https://sicoin.minfin.gob.gt/sicoinweb/login/frmlogin.htm",1,"-",1,"http://www.minfin.gob.gt/",0,0,null,2,1,2,"http://www.minfin.gob.gt/index.php/?option=com_content&view=article&id=38&Itemid=327",1,"http://www.minfin.gob.gt/manuales/files.html?folder=manuales_presupuestarios",1,1,2003,1,1,3,2012,1,1,2007,1,2,1,2003,0,null,"-",1,1,0,0,0,1,1,1,0,1,0,"-",0,"-",2,"http://www.minfin.gob.gt/archivos/prensa/notas_informativas/notinfo30_070809.pdf",1,"http://www.minfin.gob.gt/presupaprobado/presupaprobados/files.html?folder=2012\\Segunda%20Parte%20Detalle%20Cuantitativo\\presupuesto_de_egresos_por_institucion&start=15",0,"http://www.ine.gob.gt","Guatemala Instituto Nacional de Estadistica","http://www.banguat.gob.gt ","Bank of Guatemala","-",1,"http://www.minfin.gob.gt/laip_mfp/4.html",1,"http://www.minfin.gob.gt/leyespresupuesto.html",2,"National laws and regulations",1,3,"Facebook, Twitter, Youtube","spa","-","-","-","-","SIAF","Sistema Integrado de Administración Financiera","C","F",1,2011,"C+L",2,1,"LDSW > Oracle","Web","Jul 2010","Public","C","A","A","B","B+","C","D+","D+","C+","D+",2.5499999999999998,2.4655172413793105,51,50,1,0,112,0.439,0.46410000000000001,0.22470000000000001,0.62839999999999996,"LCR",null,null,null,null,"Guatemala",0,null,null,null,null,0,null,null,null,null,null,20,76.923076923076934,"A",null,68,"Guatemala","GTM",2006,13.5,2011,53.7,1992.23766,7924.6786920000004,null,null,"DAD"]
[69,null,"Guinea","LIC",10221.808000000001,4417.7819249793574,430,"http://www.guinee.gov.gn","Ministry of Economy and Finance",0,"-",1,"http://www.imf.org/external/np/otm/2009/110109a.pdf",0,"-",0,"-",0,0,"-",0,0,0,"-",0,"-",0,null,"-",0,null,"-","-",0,null,"-",0,null,null,"-",0,null,"-",0,0,0,0,0,0,0,0,0,0,0,"-",0,"-",0,"-",0,"-",0,"http://www.stat-guinee.org","Guinea National Statistics Directorate ","http://www.bcrg.gov.gn","Central Bank of the Republic of Guinea","-",0,"-",0,"-",0,"-",0,0,"-","fre","-","-","-","-","CBMS","Computerized Budget Management System","C","F",3,2012,"C",1,0,"?","Web","Jul 2007","Final","X","X","X","X","X","X","X","X","X","X",1.85,1.6129032258064515,"-","-",null,2,"-","-","-","-","-","AFR",null,null,null,"F","Guinea",0,null,null,null,null,0,null,null,null,null,null,1,3.8461538461538463,"D",null,69,"Guinea","GIN",2007,43.3,2012,55.2,4426.042864,5642.438016000001]
[70,null,"Guinea-Bissau","LIC",1547.0609999999999,930.98296589537881,600,"http://minfin-gov.bissau.net","Ministerio das Financas da Guine Bissau",2,"http://minfin-gov.bissau.net/index.php?option=com_content&view=article&id=78&Itemid=93",2,"http://www.sndi.ci/component/content/article/78",1,"-",0,"-",0,0,"-",1,1,0,"-",0,"-",1,1,2007,0,null,"-","-",0,null,"-",1,4,1,2007,0,null,"-",0,1,1,1,1,1,1,0,0,0,0,"-",0,"-",0,"-",0,"-",0,"http://www.stat-guinebissau.com","Guinea-Bissau National Institute of Statistics and Censuses","http://www.bceao.int ","Central Bank of West African States (BCEAO)","-",0,"-",1,"http://minfin-gov.bissau.net/index.php?option=com_content&view=article&id=62&Itemid=69",0,"-",1,1,"-","por","-","-","-","-","SIGFIP","Système Intégré de Gestion des Finances Publiques","C","F",1,2010,"C+L",2,1,"LDSW > Oracle","Web","May 2009","Public","D","B","D","D+","NA","D","D","D+","D","D",1.3333333333333333,1.2777777777777777,"-","-",null,0,182,0.19450000000000001,0.1046,5.11E-2,0.42780000000000001,"AFR",null,null,null,"F","Guinea-Bissau",0,null,null,null,null,0,null,null,null,null,null,11,42.307692307692307,"C",null,70,"Guinea-Bissau","GNB",2002,48.9,2010,69.3,756.5128289999999,1072.1132729999999,null,2010]
[71,null,"Guyana","LMIC",756.04,2577,3408.5498121792498,"http://www.finance.gov.gy","Guyana Ministry of Finance",2,"http://www.finance.gov.gy/publications/budget-speeches",2,"http://www.finance.gov.gy/about-us/organisation/ag",1,"-",0,"-",0,0,"-",1,1,0,"-",0,"-",1,0,2008,0,null,"-","-",0,null,"-",1,4,0,2008,0,null,"-",1,1,1,0,0,1,1,0,1,1,1,"http://eprocure.gov.gy/index.php?option=com_content&view=category&layout=blog&id=81&Itemid=111",0,"-",0,"-",0,"-",0,"http://www.statisticsguyana.gov.gy","Guyana Bureau of Statistics","http://www.bankofguyana.org.gy","Bank of Guyana","-",0,"-",1,"http://www.finance.gov.gy/about-us/organisation/ob",0,"National laws and regulations",0,2,"-","eng","-","-","-","-","IFMAS","Integrated Financial Management and Accounting System","C","T",1,2004,"C",1,2,"FreeBalance","CS","Dec 2007","Draft","X","X","X","X","X","X","X","X","X","X",2.4,2.25,"-","-",null,0,109,0.45490000000000003,0.25490000000000002,0.25359999999999999,0.85619999999999996,"LCR",null,null,null,null,"Guyana",0,null,null,null,null,0,null,null,null,null,null,9,34.615384615384613,"C",null,71,"Guyana","GUY",1998,8.6999999999999993,null,null,65.775479999999988]
[72,null,"Haiti","LIC",10123.787,7050.2233105556106,700,"http://www.mefhaiti.gouv.ht","Ministère de l'Economie et des Finances",1,"http://www.mefhaiti.gouv.ht/budget.htm",1,"http://www-wds.worldbank.org/external/default/WDSContentServer/WDSP/IB/2008/07/10/000333037_20080710023439/Rendered/PDF/446510PUB0HT0P101Official0Use0Only1.pdf",1,"-",1,"http://www.mefhaiti.gouv.ht/index.htm",0,0,"-",1,1,0,"-",1,"http://www.mefhaiti.gouv.ht/",1,1,2001,0,null,"-","-",1,0,2009,1,4,1,2001,0,null,"-",1,1,0,0,0,1,1,0,1,1,1,"http://www.mefhaiti.gouv.ht/marche_public.htm",0,"-",0,"-",0,"-",0,"http://www.ihsi.ht","Institut Haïtien de Statistique et d’Informatique","http://www.brh.net","Central Bank of Haiti","-",0,"-",0,"-",0,"National laws and regulations",1,1,"-","fre","-","-","-","-","SYSDEP","Système d’Informatisation des Dépenses / Expenditure Management System","C","F",1,2005,"C",1,1,"LDSW > Oracle","CS","Nov 2011","Draft","X","X","X","X","X","X","X","X","X","X",1.3333333333333333,1.5,"-","-",null,0,187,0.1512,9.1499999999999998E-2,6.9800000000000001E-2,0.29220000000000002,"LCR",null,null,null,"F","Haiti",0,null,null,null,null,0,null,null,null,null,null,12,46.153846153846153,"C",null,72,"Haiti","HTI",2001,61.7,2001,77,6246.3765789999998,7795.3159900000001,null,2009,"DAD"]
[73,null,"Honduras","LMIC",7754.6869999999999,15381.732016855245,1980,"http://www.sefin.gob.hn","Honduras Secretaría de Finanzas",2,"http://www.sefin.gob.hn/?page_id=196",2,"http://www.sefin.gob.hn/?page_id=17",1,"-",0,"-",0,0,"-",1,1,1,"http://www.sefin.gob.hn",1,"http://www.sefin.gob.hn/bisefin",1,1,2007,1,0,3,2012,1,1,2008,1,3,1,2007,1,1,2007,1,1,1,1,0,1,1,1,1,0,1,"http://www.sefin.gob.hn/?page_id=8248",0,"-",2,"http://www.sefin.gob.hn/wp-content/uploads/SAMI/index.html",1,"http://www.sefin.gob.hn/?page_id=2398",0,"http://www.ine-hn.org","Honduras Instituto Nacional de Estadistica ","http://www.bch.hn","Central Bank of Honduras","-",0,"-",1,"http://www.sefin.gob.hn/?page_id=5395",0,"National laws and regulations",0,2,"-","spa","-","-","-","-","SIAFI","Sistema de Administración Financiera Integrada","C","F",3,2006,"C+L",2,1,"LDSW > Oracle","Web","Oct 2011","Final","X","X","X","X","X","X","X","X","X","X",3.05,2.6129032258064515,53,11,1,1,117,0.43409999999999999,0.37909999999999999,0.21729999999999999,0.70599999999999996,"LCR",null,null,null,null,"Honduras",0,null,null,null,null,0,null,null,null,null,null,18,69.230769230769226,"B",null,73,"Honduras","HND",2009,17.899999999999999,2010,66.2,1388.0889729999999,5133.6027940000004,null,2011,"DAD"]
[74,null,"Hong Kong SAR, China","HIC",7071.6,254625.28234284907,36010,"http://www.fstb.gov.hk","Hong Kong Financial Services and the Treasury Bureau",2,"http://www.budget.gov.hk/2013/index.html",2,"http://www.try.gov.hk/internet/ehabou_serv_pledge3.html",1,"-",0,"-",0,0,"-",2,1,0,"-",1,"http://www.budget.gov.hk/2013/eng/estimates.html",1,1,1997,1,1,5,1997,1,1,2000,1,2,1,2002,0,null,"-",1,1,"n/a",0,0,1,1,"n/a",1,1,1,"http://www.fstb.gov.hk/tb/eng/procurement/tender02.html",1,"http://www.gov.hk/en/theme/psi/datasets/","n/a","-","n/a","-",1,"http://www.info.gov.hk/censtatd","Hong Kong Special Administrative Region Census and Statistics Department","http://www.hkma.gov.hk","Hong Kong Monetary Authority","-",1,"http://www.fstb.gov.hk/tb/eng/access/content.html",0,"-",1,"-",0,3,"-","chi","eng","-","-",1,"GFMIS","Government Financial Management Information System","D","F",1,2009,"C",1,2,"Oracle","Web","-","-","-","-","-","-","-","-","-","-","-","-","-","-","-","-",null,1,"-","-","-","-","-","EAP",null,null,"APEC",null,"Hong Kong SAR, China",3,1,2,null,null,0,null,null,null,null,"2013-05-06",17,65.384615384615387,"B",null,74,"Hong Kong SAR, China","HKG"]
[75,null,"Hungary","HIC",9971,126920.98043358022,12730,"http://www.kormany.hu/hu/nemzetgazdasagi-miniszterium","Ministry for National Economy",2,"http://www.kormany.hu/hu/nemzetgazdasagi-miniszterium/allamhaztartasert-felelos-allamtitkarsag/hirek/koltsegvetesi-beszamolo",1,"http://www-wds.worldbank.org/external/default/WDSContentServer/WDSP/IB/2003/03/07/000094946_0301180408511/Rendered/PDF/multi0page.pdf",1,"-",0,"-",0,0,"-",1,1,0,"-",0,"-",1,1,2003,0,null,"-","-",0,null,"-",1,4,1,2003,1,1,2001,1,1,1,0,0,1,1,1,1,1,0,"-",0,"-",0,"-",0,"-",1,"http://portal.ksh.hu","Hungarian Central Statistical Office","http://www.mnb.hu","Magyar Nemzeti Bank ","-",0,"-",1,"http://www.kormany.hu/hu/kulugyminiszterium/szervezet",0,"-",0,3,"-","hun","eng","-","-",0,"GFMIS","Government Financial Management Information System","C","F",1,2002,"C+L",1,1,"LDSW > Oracle","Web","-","-","-","-","-","-","-","-","-","-","-","-","-","-","-","-",1,1,31,0.72009999999999996,0.68630000000000002,0.56769999999999998,0.90649999999999997,"ECA","EU","OECD",null,null,"Hungary",0,null,null,null,null,0,null,null,null,null,null,12,46.153846153846153,"C",null,75,"Hungary","HUN",2007,"<2",null,null,17]
[76,null,"Iceland","HIC",319,11108.216317566747,34820,"http://www.ministryoffinance.is","Fjármálaráðuneytið - Ministry of Finance, Iceland",2,"http://www.ministryoffinance.is/government-finance/fiscal-budget/",2,"http://hamar.stjr.is",1,"-",0,"-",0,0,"-",1,1,0,"-",0,"-",1,1,2002,1,1,4,2004,0,null,"-",0,null,null,"-",1,1,2002,1,1,1,1,0,1,1,0,1,0,0,"-",0,"-",0,"-",0,"-",1,"http://www.statice.is","Statistics Iceland ","http://www.sedlabanki.is ","Central Bank of Iceland","-",0,"-",1,"http://www.fjarmalaraduneyti.is/log_og_reglugerdir/",1,"-",0,2,"-","ice","eng","-","-",0,"HAMAR","Government Accounting and Planning System","C","F",1,2003,"C+L",1,2,"Oracle","Web","-","-","-","-","-","-","-","-","-","-","-","-","-","-","-","-",null,1,22,0.78349999999999997,0.54249999999999998,0.87719999999999998,0.93100000000000005,null,"EUR","OECD",null,null,"Iceland",1,null,null,1,null,0,null,null,null,null,null,13,50,"B",null,76,"Iceland","ISL"]
[77,null,"India","LMIC",1241491.96,1746476.2972166166,1410,"http://www.finmin.nic.in","India Ministry of Finance",2,"http://www.finmin.nic.in/reports/annualreport.asp",2,"http://www.nic.in/hqpage?hqid=1",2,"http://cga.nic.in/default.aspx",0,"-",1,1,"http://www.finmin.nic.in/the_ministry/dept_expenditure/cca/cca_exp_stat.asp",2,1,1,"http://cga.nic.in/Forms/contentpage.aspx?Lid=2531",1,"http://indiabudget.nic.in/afs.asp",1,1,1996,1,1,3,2004,0,null,"-",1,3,1,2004,1,1,1999,1,1,0,0,0,1,1,0,1,1,1,"http://eprocure.gov.in/cppp/",1,"https://www.data.gov.in",0,"-",1,"http://www.cga.nic.in/",3,"http://mospi.nic.in","India Ministry of Statistics and Programme Implementation","http://www.rbi.org.in ","Reserve Bank of India","http://indiabudget.nic.in/index.asp",0,"-",1,"http://finmin.nic.in/law/index.asp",0,"-",0,2,"Facebook","hin","eng","-","-",0,"IFMIS","Integrated Financial Management Information System","D","T",1,2007,"C+L",1,1,"LDSW > MS SQL","Web","Mar 2010","Public","A","A","A","D","B","A","C+","C+","D+","NU",2.9444444444444446,2.75,68,67,null,1,125,0.38290000000000002,0.53590000000000004,0.11020000000000001,0.50249999999999995,"SAR",null,null,null,null,"India",6,2,2,2,null,6,2,1,3,null,null,21,80.769230769230774,"A",null,77,"India","IND",2010,32.700000000000003,2010,29.8,405967.87092000002,369964.60408000002,null,null,"DAD"]
[78,null,"Indonesia","LMIC",242325.63800000001,712737.21185342083,2940,"http://www.depkeu.go.id","Ministry of Finance of Republic of Indonesia",2,"http://www.depkeu.go.id/Ind/others/InformasiPublik/default.asp",2,"http://www.span.depkeu.go.id",1,"-",0,"-",0,0,"-",1,1,0,"-",0,"-",1,0,2012,1,1,5,2010,0,null,"-",1,4,1,2010,1,1,2005,0,0,1,0,0,1,1,1,1,1,1,"http://www.lkpp.go.id/v3/",1,"http://satupemerintah.net",0,"-",1,"http://www.sjdih.depkeu.go.id/fullText/2011/238~PMK.05~2011Per.HTM",0,"http://www.bps.go.id","Statistics Indonesia","http://www.bi.go.id ","Bank Indonesia","-",0,"-",1,"http://www.depkeu.go.id/Ind/Organization/?prof=tupoksi",0,"-",1,3,"-","ind","eng","-","-",0,"SPAN","Sistem Perbendaharaan dan Anggaran Negara / State Treasury and Budgetary System","C","F",3,2013,"C+L",1,2,"Oracle","Web","Sep 2011","Draft","X","X","X","X","X","X","X","X","X","X",2.75,2.6451612903225805,62,51,1,1,97,0.49490000000000001,0.49669999999999997,0.18970000000000001,0.79820000000000002,"EAP",null,null,"APEC",null,"Indonesia",4,2,null,2,null,0,null,null,null,null,"2013-05-02",14,53.846153846153847,"B",null,78,"Indonesia","IDN",2010,18.100000000000001,2012,12,43860.940478000004,29079.076560000001,null,null,"DAD"]
[79,null,"Iran","UMIC",74798.599000000002,331000,4425.2165739093589,"http://www.mefa.gov.ir","Iran Ministry of Economy and Finance Affairs",1,"http://www.mefa.gov.ir/Portal/Home/ShowPage.aspx?Object=EVENT&CategoryID=105f2ea5-2e88-47bd-acfa-8bfe5731d984&WebPartID=066c8d89-97db-4f84-8440-1141e6724fea",0,"-",1,"-",0,"-",0,0,"-",0,0,0,"-",0,"-",0,null,"-",0,null,"-","-",0,null,"-",0,null,null,"-",0,null,"-",0,0,0,0,0,0,0,0,0,0,0,"-",0,"-",0,"-",0,"-",0,"http://www.sci.org.ir","Statistics Center of Iran","http://www.cbi.ir","The Central Bank of the Islamic Republic of Iran","-",0,"-",1,"http://www.mefa.gov.ir/Portal/Home/Default.aspx?CategoryID=89dbf90c-b08e-4dc8-80b6-aef25da59441",0,"-",0,1,"-","per","eng","-","-",0,"-","-","C","-","-","-","-","-","-","-","-","-","-","-","-","-","-","-","-","-","-","-","-","-","-","-","-",null,0,100,0.48759999999999998,0.49020000000000002,0.26379999999999998,0.70889999999999997,"MNA",null,null,null,null,"Iran",0,null,null,null,null,0,null,null,null,null,null,2,7.6923076923076925,"D",null,79,"Iran","IRN",2005,"<2",null,null,1085]
[80,null,"Iraq","LMIC",32961.959000000003,86976.461987870891,2640,"http://www.mof.gov.iq","Iraq Ministry of Finance",2,"http://www.mof.gov.iq/default.aspx",1,"http://imagebank.worldbank.org/servlet/WDSContentServer/IW3P/IB/2012/05/03/000356161_20120503031547/Rendered/PDF/684930PUB0EPI007926B009780821395295.pdf",1,"-",0,"-",0,0,"-",1,0,0,"-",0,"-",1,1,2007,0,null,"-","-",0,null,"-",0,null,null,"-",0,null,"-",0,0,0,0,0,0,0,0,0,0,0,"-",0,"-",0,"-",0,"-",0,"http://cosit.gov.iq","Central Organization for Statistics","http://www.cbi.iq","Central Bank of Iraq","-",0,"-",0,"-",0,"-",1,1,"-","ara","-","-","-","-","IFMIS","Iraq Financial Management Information System","C","F",3,2014,"C",1,2,"FreeBalance","Web","Jun 2008","Final","X","X","X","X","X","X","X","X","X","X",1.35,1.6,4,0,null,1,137,0.34089999999999998,0.28760000000000002,0.1201,0.61509999999999998,"MNA",null,null,null,"F","Iraq",0,null,null,null,null,0,null,null,null,null,null,7,26.923076923076923,"C",null,80,"Iraq","IRQ",2007,2.8,2007,22.9,922.93485199999998,7548.2886109999999,null,null,"DAD"]
[81,null,"Ireland","HIC",4487,179152.61458095984,39930,"http://www.finance.gov.ie","Ireland Department of Finance",2,"http://budget.gov.ie/budgets/2013/2013.aspx",1,"http://www.finance.gov.ie/documents/publications/other/mifpireport.pdf",1,"-",1,"http://www.irelandstat.gov.ie",0,0,"-",2,1,1,"http://budget.gov.ie/budgets/2013/Documents/Budget%202013%20Leaflet.pdf",1,"http://govacc.per.gov.ie/accounting/",1,1,1996,1,1,5,2000,1,1,2004,1,2,1,1996,1,1,1996,1,1,0,0,1,1,1,0,1,1,1,"http://www.procurement.ie/",1,"http://www.statcentral.ie",0,"-",0,"-",2,"http://www.cso.ie","Ireland Central Statistics Office","http://www.centralbank.ie","Central Bank and Financial Services Authority of Ireland","http://databank.per.gov.ie/#",0,"-",1,"http://per.gov.ie/organisation-chart/",2,"GFS + ESA 95",0,2,"-","eng","irs","-","-",0,"FMIS","Financial Management Information System","D","F",1,2005,"C+L",1,2,"UNIT4 > Agresso","Web","-","-","-","-","-","-","-","-","-","-","-","-","-","-","-","-",0,1,34,0.71489999999999998,0.53590000000000004,0.65529999999999999,0.95350000000000001,null,"EU","OECD",null,null,"Ireland",1,1,null,null,null,0,null,null,null,null,"2013-05-03",20,76.923076923076934,"A",null,81,"Ireland","IRL"]
[82,null,"Israel","HIC",7765.7,224684.21817451186,28930,"http://www.mof.gov.il","Israel Ministry of Finance",2,"http://www.mof.gov.il/BudgetSite/Pages/BudgetSiteHP.aspx",1,"http://www.ctg.albany.edu/publications/reports/proi_case_merkava?chapter=4&section=2",1,"-",0,"-",0,0,"-",1,1,0,"-",1,"http://www.ag.mof.gov.il/AccountantGeneral/AccountantGeneral/AccountantGeneralTopNav/AGSubjects/moneyinformation/Report2011",1,1,1996,1,0,3,2009,0,null,"-",1,2,1,1996,0,null,"-",1,1,0,0,0,1,1,0,1,1,1,"http://vehicle.mof.gov.il/Mof/Rechev/MofRechevTopNav/MofRechevBuy/MofRechevLastBuy",1,"http://www.data.gov.il",0,"-",0,"-",1,"http://www.cbs.gov.il","Israel Central Bureau of Statistics","http://www.bankisrael.gov.il ","Bank of Israel","-",0,"-",1,"http://www.mof.gov.il/ABOUT/Pages/AboutPage.aspx",0,"National laws and regulations",0,1,"Facebook, Linkedin, Twitter, Youtube","heb","eng","-","-",0,"MERKAVA","Financial Management Information System","D","F",1,2010,"C+L",1,2,"SAP","Web","-","-","-","-","-","-","-","-","-","-","-","-","-","-","-","-",1,1,16,0.81,0.84970000000000001,0.68589999999999995,0.89449999999999996,"MNA",null,"OECD",null,null,"Israel",4,1,1,1,1,0,null,null,null,null,null,12,46.153846153846153,"C",null,82,"Israel","ISR"]
[83,null,"Italy","HIC",60770,2144710.8107860144,35290,"http://www.mef.gov.it","Ministry of Economy and Finance",2,"http://www.tesoro.it/doc-finanza-pubblica/",2,"http://www.rgs.mef.gov.it/ENGLISH-VE/SIOPE1",1,"-",0,"-",0,0,"-",2,1,0,"-",0,"-",1,1,1998,1,1,3,1998,0,null,"-",1,4,1,2007,0,null,"-",1,1,0,0,0,1,0,1,1,1,1,"http://www.peppol.eu/",1,"http://www.dati.gov.it/",0,"-",1,"http://www.rgs.mef.gov.it/VERSIONE-I/RGS-sul-te/",0,"http://www.istat.it","Italy National Statistical Institute","http://www.bancaditalia.it","Bank of Italy","-",1,"http://legislationline.org/topics/topic/3",1,"http://www.mef.gov.it/ministero/di-piu-mef/funzioni-organizzazione.asp",0,"-",0,3,"-","ita","eng","-","-",0,"SIOPE","Sistema Informativo sulle Operazioni degli enti Pubblici / Information System on the Operations of Government Bodies","D","T",1,2006,"C",1,2,"SAP","Web","-","-","-","-","-","-","-","-","-","-","-","-","-","-",60,58,1,2,32,0.71899999999999997,0.57520000000000004,0.66969999999999996,0.91200000000000003,null,"EU","OECD",null,null,"Italy",9,2,3,3,1,8,3,null,5,null,null,14,53.846153846153847,"B",null,83,"Italy","ITA"]
[84,null,"Jamaica","UMIC",2709.3,14440,5329.7899826523453,"http://www.mof.gov.jm","Jamaica Ministry of Finance and Planning",2,"http://www.mof.gov.jm/budget",2,"http://www.fsl.org.jm/systems/financial-management-information-system",1,"-",0,"-",0,0,"-",1,1,0,"-",0,"-",1,1,2004,0,null,"-","-",0,null,"-",0,null,null,"-",0,null,"-",1,1,0,0,0,1,1,0,1,0,0,"-",0,"-",0,"-",0,"-",0,"http://www.statinja.com","Statistical Institute of Jamaica","http://www.boj.org.jm ","Bank of Jamaica","-",0,"-",0,"-",0,"-",0,1,"-","eng","-","-","-","-","FMIS","Financial Management Information System","C","T",1,2002,"C+L",2,1,"LDSW > Informix","CS","May 2007","Public","A","C","B","C+","D+","C","C+","D+","C+","C",2.35,2.4333333333333331,"-","-",null,0,108,0.45519999999999999,0.30719999999999997,0.26679999999999998,0.79159999999999997,"LCR",null,null,null,null,"Jamaica",0,null,null,null,null,0,null,null,null,null,null,9,34.615384615384613,"C",null,84,"Jamaica","JAM",2004,"<2",2010,17.600000000000001,null,476.8368000000001]
[85,null,"Japan","HIC",127817.277,5739473.8339573797,44900,"http://www.mof.go.jp","Ministry of Finance of Japan",2,"http://www.mof.go.jp/budget/index.html",1,"http://www.cao.go.jp/sasshin/koukyo-service/publication/110428/puroguramu_english.pdf",2,"http://www.bb.mof.go.jp/YDS/search/YDSG010;jsessionid=JNCPISKP937B9E84FCULEPTFD60EI1QVF8V6KLEKFCE851LQOK8HBNAU44S020001C000000.yds_001",1,"http://www.bb.mof.go.jp/hdocs/bxss010bh24.html",0,0,"-",2,1,0,"-",0,"-",1,1,1998,1,0,5,2001,1,1,2005,0,null,null,"-",0,null,"-",1,1,1,0,0,1,1,0,1,0,0,"-",0,"-",1,"http://www.hca.org.vn/su_kien/sk_HCA/toan_canh_CNTT/nam2011/hoithao_vio11/tranvannam.pdf",0,"-",0,"http://www.stat.go.jp","Japan Statistics Bureau ","http://www.boj.or.jp","Bank of Japan","-",0,"-",1,"http://www.mof.go.jp/english/about_mof/index.html",0,"-",0,1,"Facebook, Google+, Twitter, Youtube","jpn","eng","-","-",0,"ADAMS","Governmental Accounting Affairs Data Communication Management Systems","C","T",1,2009,"C+L",1,2,"SAP","Web","-","-","-","-","-","-","-","-","-","-","-","-","-","-","-","-",null,1,18,0.80189999999999995,0.86270000000000002,0.64600000000000002,0.89690000000000003,"EAP",null,"OECD","APEC",null,"Japan",3,3,null,null,null,2,null,null,2,null,null,14,53.846153846153847,"B",null,85,"Japan","JPN"]
[86,null,"Jordan","UMIC",6181,27082.325064720673,4380,"http://www.mof.gov.jo","Jordan Ministry of Finance",2,"http://www.gbd.gov.jo",2,"http://www.gfmis.gov.jo/ar",1,"-",0,"-",0,0,"-",1,1,0,"-",0,"-",1,1,2002,1,1,3,2008,0,null,"-",1,2,1,2002,0,null,"-",1,1,0,0,0,1,1,0,1,0,0,"-",1,"http://www.jordan.gov.jo/wps/portal",0,"-",0,"-",0,"http://www.dos.gov.jo","Jordan Department of Statistics","http://www.cbj.gov.jo ","Central Bank of Jordan","-",0,"-",1,"http://www.mof.gov.jo/ar/Pages.php?page=OpPage&id=32",0,"IMF Observance of Standards and Codes (ROSC)",0,1,"-","ara","eng","-","-",0,"GFMIS","Government Financial Management Information System","C","F",3,2013,"C+L",1,2,"Oracle","Web","Nov 2011","Draft","X","X","X","X","X","X","X","X","X","X",2.65,2.6,57,50,1,2,98,0.4884,0.39219999999999999,0.2717,0.80130000000000001,"MNA",null,null,null,null,"Jordan",1,null,1,null,null,0,null,null,null,null,null,13,50,"B",null,86,"Jordan","JOR",2010,"<2",2008,13.3,7,822.07299999999998]
[87,null,"Kazakhstan","UMIC",16558.458999999999,136727.21161794054,8260,"http://www.minfin.kz","Kazakhstan Ministry of Finance",2,"http://www.minfin.gov.kz/irj/portal/anonymous?NavigationTarget=ROLES://portal_content/prototype_mf/roles/com.saprun.mf_anonymous_roles/com.saprun.mf_anonymous_en/Information_about_budget_performance/State-budget-of-the-Republic-of-Kazakhstan/Consolidated-budget",1,"http://www-wds.worldbank.org/external/default/WDSContentServer/WDSP/IB/2003/06/27/000112742_20030627113447/Rendered/PDF/257110ICR0.pdf",1,"-",1,"http://www.minfin.gov.kz/irj/portal/anonymous?NavigationTarget=ROLES://portal_content/prototype_mf/roles/com.saprun.mf_anonymous_roles/com.saprun.mf_anonymous_kk/info_for_grajdan/for_abkzmasa/for_bakzmasa",0,0,"-",1,1,0,"-",0,"-",1,1,2006,1,0,3,2010,0,null,"-",1,2,1,2006,0,null,"-",1,1,1,0,0,1,1,1,1,0,0,"-",0,"-",0,"-",1,"http://www.minfin.gov.kz/irj/portal/anonymous?NavigationTarget=ROLES://portal_content/prototype_mf/roles/com.saprun.mf_anonymous_roles/com.saprun.mf_anonymous_en/Information_about_budget_performance/State-budget-of-the-Republic-of-Kazakhstan/Local-budgets",0,"http://www.stat.kz","Kazakhstan Agency of Statistics","http://www.nationalbank.kz","National Bank of Kazakhstan","-",0,"-",1,"http://www.minfin.gov.kz/irj/portal/anonymous?NavigationTarget=ROLES://portal_content/prototype_mf/roles/com.saprun.mf_anonymous_roles/com.saprun.mf_anonymous_en/about_ministr/reg_min",0,"IFRSPS  International Public Sector Financial Reporting ",0,1,"Blog of the Minister","kaz","rus","eng","-",0,"Treasury","Treasury System","C","T",1,2002,"C+L",1,2,"Oracle","Web","Jun 2009","Final","X","X","X","X","X","X","X","X","X","X",2.7777777777777777,3.0535714285714284,48,38,null,1,38,0.68440000000000001,0.7843,0.35549999999999998,0.91339999999999999,"ECA",null,null,null,null,"Kazakhstan",0,null,null,null,null,0,null,null,null,null,null,12,46.153846153846153,"C",null,87,"Kazakhstan","KAZ",2009,"<2",2011,5.3,18,877.59832699999981,null,null,"DAD"]
[88,null,"Kenya","LIC",41609.728000000003,34103.593965641696,820,"http://www.treasury.go.ke","Kenya Ministry of Finance and Planning",2,"http://www.treasury.go.ke/index.php?option=com_docman&Itemid=86",2,"http://www.ifmis.go.ke",1,"-",0,"-",0,0,"-",1,1,0,"-",1,"http://budget.treasury.go.ke/",1,1,2008,1,0,3,2009,0,null,"-",0,null,null,"-",1,1,2008,1,1,0,0,0,1,1,0,1,0,0,"-",1,"http://opendata.go.ke",0,"-",1,"http://www.treasury.go.ke/index.php?option=com_docman&task=cat_view&gid=110&Itemid=86",0,"http://www.cbs.go.ke","Kenya National Bureau of Statistics","http://www.centralbank.go.ke","Central Bank of Kenya","-",0,"-",0,"-",1,"-",0,3,"-","eng","-","-","-","-","IFMIS","Integrated Financial Management Information System","C","F",2,2011,"C",5,2,"Oracle","Web","Mar 2009","Public","C","B","B","C+","C+","D","C+","D+","C+","D+",2.2000000000000002,2.3548387096774195,49,49,1,2,119,0.42120000000000002,0.43140000000000001,0.1212,0.71089999999999998,"AFR",null,null,null,null,"Kenya",0,null,null,null,null,0,null,null,null,null,null,13,50,"B",null,88,"Kenya","KEN",2005,43.4,2005,45.9,18058.621952000001,19098.865151999998,null,null,"DAD"]
[89,null,"Kiribati","LMIC",101.093,204.84968558234118,2030,"http://www.mfed.gov.ki","Ministry of Finance and Economic Development",2,"http://www.mfed.gov.ki/?page_id=61",1,"http://www2.adb.org/Documents/TARs/KIR/43418-012-kir-tar.pdf",1,"-",0,"-",0,0,"-",0,0,0,"-",0,"-",1,0,2010,0,null,"-","-",0,null,"-",0,null,null,"-",0,null,"-",1,1,0,0,0,0,0,0,0,0,0,"-",0,"-",0,"-",0,"-",1,"http://www.spc.int/prism/Country/KI/Stats","Kiribati Statistics Office","http://www.anz.com/kiribati","Bank of Kiribati","-",0,"-",0,"-",0,"-",0,1,"-","eng","-","-","-","-","FMIS","Financial Management Information System","C","T",1,2001,"C",1,2,"Attaché","Web","Dec 2009","Draft","X","X","X","X","X","X","X","X","X","X",1.5,1.8275862068965518,"-","-",null,"-",149,0.29980000000000001,6.54E-2,4.6899999999999997E-2,0.78710000000000002,"EAP",null,null,null,"F","Kiribati",0,null,null,null,null,0,null,null,null,null,null,5,19.230769230769234,"D",null,89,"Kiribati","KIR"]
[90,null,"Korea, Dem. Rep.","LIC",24451.285,"-","-","http://www.korea-dpr.com","Ministry of Finance",0,"-",0,"-",0,"-",0,"-",0,0,"-",0,0,0,"-",0,"-",0,null,"-",0,null,"-","-",0,null,"-",0,null,null,"-",0,null,"-",0,0,0,0,0,0,0,0,0,0,0,"-",0,"-",0,"-",0,"-",0,"-","Central Bureau of Statistics","-","Central Bank of the Democratic People's Republic of Korea","-",0,"-",0,"-",0,"-",0,0,"-","kor","eng","-","-",0,"-","-","C","-","-","-","-","-","-","-","-","-","-","-","-","-","-","-","-","-","-","-","-","-","-","-","-",null,"-",131,0.36159999999999998,0.1176,1.12E-2,0.95599999999999996,null,"OTH",null,null,null,"Korea, Dem. Rep.",0,null,null,null,null,0,null,null,null,null,null,0,0,"D",null,90,"Korea, Dem. Rep.","PRK"]
[91,null,"Korea, Rep.","HIC",49779,1038981.4293501173,20870,"http://www.mosf.go.kr","Ministry of Strategy and Finance of the Republic of Korea",2,"http://www.mosf.go.kr/lib/lib02.jsp",2,"https://www.digitalbrain.go.kr",3,"http://www.mosf.go.kr/lib/lib01a.jsp",1,"https://www.digitalbrain.go.kr/kor/view/statis/statis03_01_01.jsp?code=DB0103",1,1,"https://www.digitalbrain.go.kr/kor/view/statis/statis01_01_01.jsp?code=DB0101",2,1,2,"http://www.mosf.go.kr/policy/policy01_total.jsp?boardType=general&hdnBulletRunno=&cvbnPath=&sub_category=&hdnFlag=&cat=&hdnDiv=&hdnSubject=%EB%82%98%EB%9D%BC%EC%82%B4%EB%A6%BC&&skey=policy&actionType=list&hdnPage=4",1,"http://www.mosf.go.kr/_upload/bbs/79/attach/2010_statistics.pdf",1,1,1991,1,1,5,2005,1,1,1991,1,4,1,1991,1,1,2003,1,1,1,1,1,1,1,1,1,1,0,"-",1,"http://www.data.go.kr",2,"http://lofin.mopas.go.kr/lofin_intro/HojoIntro.jsp",1,"https://www.digitalbrain.go.kr/kor/view/statis/statis03_03_01.jsp?code=DB010303",0,"http://kostat.go.kr/portal/korea/index.action","Korea National Statistical Office","http://eng.bok.or.kr ","Bank of Korea","-",1,"http://www.mosf.go.kr/open/open02a.jsp",1,"http://www.mosf.go.kr/info/info03a.jsp",2,"-",1,3,"-","kor","eng","-","-",0,"DBAS","Digital Budget and Accounting System","C","F",1,2007,"C+L",1,1,"LDSW > Oracle","Web","-","-","-","-","-","-","-","-","-","-","-","-","-","-",75,71,1,3,1,0.92830000000000001,1,0.83560000000000001,0.94940000000000002,"EAP",null,"OECD","APEC",null,"Korea, Rep.",7,1,null,6,null,0,null,null,null,null,"2013-05-05",26,100,"A",null,91,"Korea, Rep.","KOR"]
[92,null,"Kosovo","LMIC",1794.3030000000001,6321.6824103347235,3520,"http://mf.rks-gov.net/fillimi.aspx","Ministry of Finance",2,"http://mf.rks-gov.net/fillimi.aspx",1,"http://www.mfe-ks.org/old/Shqip/English/mefwww/departamentet/pmakroekonomike/PEFA/pefaangmakro.pdf",1,"-",0,"-",0,0,"-",1,1,0,"-",1,"http://mf.rks-gov.net/en-us/ministriaefinancave/buxhetiirepublikessekosoves/buxhetiqendrore.aspx",1,0,2009,1,0,3,2011,0,null,"-",1,2,0,2011,0,null,"-",1,1,0,0,0,1,1,1,0,0,0,"-",0,"-",0,"-",0,"-",0,"http://esk.rks-gov.net","Kosovo Agency of Statistics","http://www.bqk-kos.org","Central Bank of the Republic of Kosovo","-",0,"-",0,"-",0,"IFRS, http://mf.rks-gov.net/Zyrat/SekretariatiiKKRFse/StandardetNderkombetareteRaportimitFinanciar.aspx",0,3,"-","alb","ser","eng","-",0,"FMIS","Financial Management Information System","C","T",1,2006,"C",1,2,"FreeBalance","CS","May 2009","Public","A","B","B","C","B+","D","B+","A","B","D",2.8,2.774193548387097,"-","-",null,2,"-","-","-","-","-","ECA",null,null,null,"F","Kosovo",0,null,null,null,null,0,null,null,null,null,null,10,38.461538461538467,"C",null,92,"Kosovo","KSV",null,null,2009,34.5,null,619.03453500000001,null,2009]
[93,null,"Kuwait","HIC",2818.0419999999999,176600,62667.625251859274,"http://www.mof.gov.kw","Kuwait Ministry of Finance",2,"http://www.mof.gov.kw/Budget/ministryinfo.aspx",0,"-",1,"-",0,"-",0,0,"-",1,1,1,"http://www.mof.gov.kw/MOFServices/MOFCitizenServDetail.aspx#CitizenServ6",0,"-",1,0,2008,0,null,"-","-",0,null,"-",0,null,null,"-",0,null,"-",1,1,0,0,0,1,0,0,0,0,1,"http://www.ctc.gov.kw",0,"-",0,"-",0,"-",0,"http://www.csb.gov.kw","Central Statistical Bureau","http://www.cbk.gov.kw","Central Bank of Kuwait","http://www.e.gov.kw/sites/KGOArabic/portal/Pages/PortalMain.aspx",0,"-",1,"http://en.mof.gov.kw/MOFInfo/MOFStrcture/Default.aspx",2,"GFS published by CSB; National laws and regulations",0,3,"Facebook, Twitter","ara","eng","-","-",0,"IFS","Integrated Financial System","C","F",1,1997,"C",1,1,"LDSW > Oracle","Web","Aug 2010","Final","X","X","X","X","X","X","X","X","X","X",2.7222222222222223,2.9464285714285716,"-","-",null,1,63,0.59599999999999997,0.58169999999999999,0.41789999999999999,0.78849999999999998,"MNA",null,null,null,null,"Kuwait",0,null,null,null,null,0,null,null,null,null,null,7,26.923076923076923,"C",null,93,"Kuwait","KWT"]
[94,null,"Kyrgyz Republic","LIC",5507,4865.6272732532552,880,"http://www.minfin.kg","Ministry of Finance of the Kyrgyz Republic",2,"http://www.minfin.kg/index.php?option=com_content&view=section&id=7&Itemid=12",2,"http://www.kazna.gov.kg/index.php/modernizatsiya/isuk",2,"http://budget.okmot.kg",1,"http://www.kazna.gov.kg",0,0,"-",1,1,2,"http://map.okmot.kg",1,"http://www.minfin.kg/index.php?option=com_content&view=article&id=1307:2012-05-21-03-06-19&catid=49:2010-10-05-10-26-01&Itemid=119",1,0,2010,1,0,3,2009,0,null,"-",1,2,0,2011,1,0,2011,1,1,1,0,0,1,1,1,0,1,1,"http://map.okmot.kg",1,"http://budget.okmot.kg/en",0,"-",0,"-",3,"http://www.stat.kg","National Statistical Committee of the Kyrgyz Republic","http://www.nbkr.kg","National Bank of the Kyrgyz Republic","http://budget.okmot.kg",1,"http://budget.okmot.kg/en/instructions/index.html",1,"http://www.minfin.kg/index.php?option=com_content&view=section&id=4&Itemid=11",2,"GFS 2001 (since 2007) + National laws and regulations",1,3,"InfoSystem; MoF web site","kir","rus","eng","-",0,"TMIS","Treasury Management Information System","C","T",3,2008,"C+L",1,1,"LDSW","Web","Dec 2009","Public","B","B","C","C+","A","D","C+","D+","D+","D+",2.25,2.0499999999999998,20,15,null,1,99,0.4879,0.42480000000000001,0.1903,0.84850000000000003,"ECA",null,null,null,null,"Kyrgyz Republic",0,null,null,null,null,0,null,null,null,null,"2013-04-23",16,61.53846153846154,"B",null,94,"Kyrgyz Republic","KGZ",2010,6.7,2010,33.700000000000003,368.96899999999999,1855.8590000000002,null,2012,"DAD"]
[95,null,"Lao PDR","LMIC",6288.0370000000003,7104.7902092077493,1130,"http://www.mof.gov.la","Ministry of Finance",0,"-",1,"http://www-wds.worldbank.org/external/default/WDSContentServer/WDSP/IB/2012/03/22/000333038_20120322225943/Rendered/PDF/673470PJPR0v100edbyTACT0CTRNL0LEGES.pdf",0,"-",0,"-",0,0,"-",1,1,0,"-",0,"-",1,1,2006,0,null,"-","-",0,null,"-",1,4,0,2000,1,0,2010,0,0,0,0,0,0,1,1,0,0,0,"-",0,"-",0,"-",0,"-",0,"http://www.nsc.gov.la","Lao Statistics Agency","http://www.bol.gov.la","Bank of Lao PDR","-",0,"-",1,"http://www.na.gov.la/docs/eng/laws/econ/State%20Budget%20%282006%29%20Eng.pdf",0,"-",0,3,"-","lao","eng","-","-",0,"GFIS","Government Financial Information System","C","T",1,2011,"C+L",2,1,"LDSW > Oracle","Web","Jun 2010","Public","C","B","C","D+","C","D","C+","D+","D+","C+",1.95,2,"-","-",null,0,153,0.29349999999999998,0.2157,9.98E-2,0.56510000000000005,"EAP",null,null,null,null,"Lao PDR",1,null,1,null,null,0,null,null,null,null,"2013-04-29",7,26.923076923076923,"C",null,95,"Lao PDR","LAO",2008,33.9,2008,27.6,2131.6445430000003,1735.498212,null,2010]
[96,null,"Latvia","UMIC",2220,27418.278655221802,12350,"http://www.fm.gov.lv","Finansu Ministrija - Ministry of Finance, Latvia",2,"http://www.fm.gov.lv/lv/sadalas/valsts_budzets/valsts_budzeta_analize_un_izpilde/",2,"http://www.kase.gov.lv/?object_id=449",1,"-",1,"http://www.fm.gov.lv/lv/sadalas/valsts_budzets/budzeta_paskaidrojumi/2012_gads/",0,0,"-",1,1,0,"-",0,"-",1,1,2003,1,0,5,2008,0,null,"-",1,2,1,1998,0,null,"-",1,1,0,0,0,1,1,1,1,0,0,"-",0,"-",0,"-",0,"-",2,"http://www.csb.lv","Latvia Central Statistical Bureau","http://www.bank.lv ","Bank of Latvia","http://www.kase.gov.lv/?object_id=143",0,"-",1,"http://www.fm.gov.lv/en",0,"National laws and EU accounting (financial reporting) standards  ",0,3,"Facebook, Youtube, Twitter","lav","eng","-","-",0,"FMIS / eKASE","Government Electronic Payment System","D","F",1,2009,"C",1,2,"SAP","Web","-","-","-","-","-","-","-","-","-","-","-","-","-","-","-","-",1,2,42,0.66039999999999999,0.58819999999999995,0.50509999999999999,0.88790000000000002,"ECA","EU",null,null,null,"Latvia",0,null,null,null,null,0,null,null,null,null,"2013-04-19",13,50,"B",null,96,"Latvia","LVA",2009,"<2",2004,5.9,4,130.97999999999999]
[97,null,"Lebanon","UMIC",4259.4049999999997,38947.61920145413,9140,"http://www.finance.gov.lb","Lebanon Ministry of Finance",2,"http://www.finance.gov.lb/en-US/finance/BudgetInformation/Pages/default.aspx",1,"http://imagebank.worldbank.org/servlet/WDSContentServer/IW3P/IB/2012/05/03/000356161_20120503031547/Rendered/PDF/684930PUB0EPI007926B009780821395295.pdf",1,"-",1,"http://www.finance.gov.lb/en-US/finance/EconomicDataStatistics/Pages/PublicFinanceStatistic.aspx",0,0,"-",1,1,1,"http://www.finance.gov.lb/en-US/finance/BudgetInformation/AnnualBudgetDocuments/Documents/Annual%20Budget%20Documentation/2010/Budget%20Law/Citizen%20Budget%20FINAL%2011Feb2011.pdf",1,"http://www.finance.gov.lb/en-US/finance/BudgetInformation/Pages/AnnualBudgetDocumentsandProcess.aspx",1,1,1997,0,null,"-","-",0,null,"-",1,2,1,2000,0,null,"-",0,0,0,0,0,0,0,0,0,0,0,"-",0,"-",0,"-",0,"-",0,"http://www.cas.gov.lb","Lebanon Central Administration for Statistics","http://www.bdl.gov.lb","Central Bank of Lebanon","-",1,"http://www.finance.gov.lb/en-US/finance/Documents/Disclosures/MOFTransparency_Oct252007Final.pdf",0,"-",2,"-",0,3,"Ministry Blog","ara","eng","-","-",0,"FMIS","Financial Management Information System","C","F",3,2014,"C+L",1,1,"LDSW > Oracle","Web","Jul 2011","Final","X","X","X","X","X","X","X","X","X","X",1.8333333333333333,1.6956521739130435,33,32,null,1,87,0.51390000000000002,0.47710000000000002,0.27279999999999999,0.79169999999999996,"MNA",null,null,null,null,"Lebanon",0,null,null,null,null,0,null,null,null,null,null,{"$f":"J99+L99+N99+P99+R99+S99+U99+V99+W99+Y99+AA99+AB99+AD99+AE99+AH99+AI99+AK99+AM99+AO99+AP99","v":13},50,"B",null,97,"Lebanon","LBN",null,null,null,null,null,null,null,null,"DAD"]
[98,null,"Lesotho","LMIC",2193.8429999999998,2679.2792005106526,1220,"http://www.finance.gov.ls","Lesotho Ministry of Finance And Development Planning",2,"http://www.finance.gov.ls/home/",2,"http://www.finance.gov.ls/reforms/ifmis.php",1,"-",0,"-",0,0,"-",1,1,0,"-",1,"http://www.finance.gov.ls/documents/budget_book.php",1,1,2001,1,0,3,2010,0,null,"-",1,2,0,2004,0,null,"-",1,1,0,1,0,0,0,0,0,0,0,"-",0,"-",0,"-",0,"-",0,"http://www.bos.gov.ls","Lesotho Bureau of Statistics ","http://www.centralbank.org.ls","Central Bank of Lesotho","-",0,"-",1,"http://www.finance.gov.ls/economic/default.php",0,"-",0,2,"-","eng","-","-","-","-","IFMIS","Integrated Financial Management Information System","C","F",1,2009,"C+L",1,2,"Epicor","Web","Jul 2009","Draft","X","X","X","X","X","X","X","X","X","X",1.95,2.0172413793103448,"-","-",null,1,136,0.35010000000000002,0.30070000000000002,4.99E-2,0.69969999999999999,"AFR",null,null,null,null,"Lesotho",0,null,null,null,null,0,null,null,null,null,null,12,46.153846153846153,"C",null,98,"Lesotho","LSO",2003,43.4,2003,56.6,952.12786199999982,1241.715138,null,null,"DAD"]
[99,null,"Liberia","LIC",4128.5720000000001,1359.3186055798353,330,"http://www.mof.gov.lr","Liberia Ministry of Finance",2,"http://www.mof.gov.lr/",2,"http://www.mof.gov.lr/content.php?sub=98&related=33&res=98&third=98",1,"-",0,"-",0,0,"-",1,1,1,"https://docs.google.com/viewer?a=v&pid=sites&srcid=bW9wZWEuZ292LmxyfG10ZWYtYnVkZ2V0fGd4OjcwOGJjYzg1OGFmZWJjMzU",1,"https://docs.google.com/viewer?a=v&pid=sites&srcid=bW9wZWEuZ292LmxyfG10ZWYtYnVkZ2V0fGd4OmQyOGY4ZGYyMDI2OTMwMA",1,1,2007,1,0,3,2012,0,null,"-",0,null,null,"-",0,null,"-",1,1,0,1,0,1,1,1,1,1,0,"-",0,"-",0,"-",0,"-",2,"http://www.lisgis.org","Liberia Institute of Statistics and Geo-Information Services","http://www.cbl.org.lr","Central Bank of Liberia","https://sites.google.com/a/mopea.gov.lr/mtef-budget/home",0,"-",1,"http://www.mof.gov.lr/content.php?sub=75&related=24&res=75&third=75",1,"National laws and regulations",0,1,"-","eng","-","-","-","-","IFMIS","Integrated Financial Management Information System","C","F",3,2012,"C",3,2,"FreeBalance","Web","Jun 2009","Public","C","C","C","D+","D","D","C","C","D","D",1.55,1.8392857142857142,43,40,1,1,169,0.2407,0.1895,4.7699999999999999E-2,0.4849,"AFR",null,null,null,"F","Liberia",0,null,null,null,null,0,null,null,null,null,null,12,46.153846153846153,"C",null,99,"Liberia","LBR",2007,83.8,2007,63.8,3459.743336,2634.0289360000002,null,2008]
[100,null,"Libya","UMIC",6422.7719999999999,62360,9709.2034405082413,"http://www.mof.gov.ly","Ministry of Finance",0,"-",0,"-",0,"-",0,"-",0,0,"-",0,0,0,"-",0,"-",0,null,"-",0,null,"-","-",0,null,"-",0,null,null,"-",0,null,"-",0,0,0,0,0,0,0,0,0,0,0,"-",0,"-",0,"-",0,"-",0,"http://www.lisgis.org","Liberia Institute of Statistics and Geo-Information Services","http://www.cbl.gov.ly","Central Bank of Libya","-",0,"-",0,"-",0,"-",0,0,"-","ara","-","-","-","-","-","-","C","-","-","-","-","-","-","-","-","-","-","-","-","-","-","-","-","-","-","-","-","-","-","-","-",null,"-","-","-","-","-","-","MNA",null,null,null,"F","Libya",0,null,null,null,null,0,null,null,null,null,null,0,0,"D",null,100,"Libya","LBY"]
[101,null,"Liechtenstein","HIC",36.304000000000002,4826,132933.01013662407,"http://www.regierung.li","Ministry of Finance",1,"http://www.llv.li/amtsstellen/llv-as-staatsfinanzen.htm",0,"-",1,"-",0,"-",0,0,"-",0,0,0,"-",0,"-",0,null,"-",0,null,"-","-",0,null,"-",0,null,null,"-",0,null,"-",0,0,0,0,0,0,0,0,0,0,0,"-",0,"-",0,"-",0,"-",3,"http://www.as.llv.li","Office of Statistics","http://www.fma-li.li","Financial Marker Authority","http://www.llv.li/amtsstellen/llv-rk-amtsgeschaefte-rechenschaftsbericht.htm",0,"-",0,"-",0,"-",0,2,"Facebook, Twitter, Youtube","ger","eng","-","-",0,"-","-","C","-","-","-","-","-","-","-","-","-","-","-","-","-","-","-","-","-","-","-","-","-","-","-","-",null,"-",14,0.82640000000000002,0.58819999999999995,1,0.89100000000000001,null,"EUR",null,null,null,"Liechtenstein",0,null,null,null,null,0,null,null,null,null,null,2,7.6923076923076925,"D",null,101,"Liechtenstein","LIE"]
[102,null,"Lithuania","UMIC",3203,39322.320283326699,12280,"http://www.finmin.lt","Ministry of Finance of the Republic of Lithuania",2,"http://www.finmin.lt/web/finmin/aktualus_duomenys",1,"http://www.finmin.lt/web/finmin/vsakis",1,"-",0,"-",1,0,"http://www.finmin.lt/finmin.lt/failai/Biudzeto_vykdymas/VBI_2012_12_31_pdf.pdf",1,1,1,"http://www.finmin.lt/web/finmin/2013_biudzetas",1,"http://www3.lrs.lt/pls/inter3/dokpaieska.showdoc_l?p_id=346930",1,1,1991,1,1,3,1998,1,1,2001,1,2,1,2001,1,1,1995,1,1,0,0,0,1,1,1,1,1,1,"http://www.finmin.lt/web/finmin//auktualus_duomenys/biudzeto_pajamos/valstybes_biudzetas",0,"-",1,"http://www.finmin.lt/web/finmin/vsakis",1,"http://vsamidb.finmin.lt/CAisd/pdmweb.exe",1,"http://www.stat.gov.lt","Lithuania Statistics Department","http://www.lbank.lt","Bank of Lithuania","www.viesai.lt",1,"http://www.finmin.lt/web/finmin/aktualus_duomenys",1,"http://www.finmin.lt/c/portal/layout?p_l_id=PUB.1.37",1,"Lithuianian law and International Accounting Standards, European Union Law and International Public Sector Accounting Standards.",1,3,"-","lit","eng","-","-",0,"VSAKIS","Viešojo sektoriaus apskaitos ir ataskaitų konsolidavimo informacinė sistem / Public Sector Accounting and Consolidation Reporting Information System","C","F",1,2012,"C",1,2,"SAP","Web","-","-","-","-","-","-","-","-","-","-","-","-","-","-","-","-",1,1,29,0.73329999999999995,0.69930000000000003,0.57650000000000001,0.92400000000000004,"ECA","EU",null,null,null,"Lithuania",0,null,null,null,null,0,null,null,null,null,"2013-05-10",19,73.076923076923066,"B",null,102,"Lithuania","LTU",2008,"<2",null,null,5]
[103,null,"Luxembourg","HIC",517,40108.931521497223,77580,"http://www.mf.public.lu","Ministère des Finances",2,"http://www.mf.public.lu/finances_publiques/budget/index.html",2,"http://www.sifin.etat.lu",1,"-",0,"-",0,0,"-",1,1,0,"-",1,"http://www.legilux.public.lu/leg/a/archives/2011/0266/a266.pdf",1,0,2002,0,null,"-","-",0,null,"-",0,null,null,"-",0,null,"-",1,1,0,0,0,1,0,0,0,0,0,"-",0,"-",0,"-",0,"-",3,"http://www.statec.public.lu","Luxembourg National Institute of Statistics and Economic Studies ","http://www.bcl.lu","Central Bank of Luxembourg","http://www.te.public.lu/dette_publique/index.html",0,"-",1,"http://www.mf.public.lu/ministere/index.html",0,"-",0,1,"-","fre","-","-","-","-","SIFIN","Integrated Financial Management Information System","D","F",1,2006,"C+L",1,2,"SAP","Web","-","-","-","-","-","-","-","-","-","-","-","-","-","-","-","-",null,1,19,0.8014,0.69930000000000003,0.86439999999999995,0.84040000000000004,null,"EU","OECD",null,null,"Luxembourg",0,null,null,null,null,0,null,null,null,null,null,9,34.615384615384613,"C",null,103,"Luxembourg","LUX"]
[104,null,"Macao SAR, China","HIC",555.73099999999999,36430,65553.298268406841,"http://www.dsf.gov.mo","Macao Department of Finance",2,"http://www.dsf.gov.mo/finance/public_finance_info.aspx?FormType=4&#budget",0,"-",1,"-",0,"-",0,0,"-",1,1,0,"-",0,"-",0,null,"-",0,null,"-","-",0,null,"-",1,4,1,2010,0,null,"-",1,0,0,0,0,0,0,0,0,0,0,"-",0,"-",0,"-",0,"-",0,"http://www.dsec.gov.mo","Macau Special Administrative Region Statistics and Census Service","http://www.amcm.gov.mo","Monetary Authority of Macao","-",0,"-",1,"http://www.dsf.gov.mo/about/about_org.aspx",0,"-",0,2,"-","chi","eng","por","-",0,"-","-","C","-","-","-","-","-","-","-","-","-","-","-","-","-","-","-","-","-","-","-","-","-","-","-","-",null,"-","-","-","-","-","-","EAP",null,null,null,null,"Macao SAR, China",1,1,null,null,null,0,null,null,null,null,null,7,26.923076923076923,"C",null,104,"Macao SAR, China","MAC"]
[105,null,"Macedonia","UMIC",2063.893,9752.3457135706467,4730,"http://www.finance.gov.mk","Ministry of Finance of the Republic of Macedonia",2,"http://www.finance.gov.mk/node/575",2,"http://www.ultra.com.mk/newweb/public_admin2.html",1,"-",0,"-",0,0,"-",2,1,0,"-",1,"http://www.finance.gov.mk/files/u11/tkovniot_plan_i_sodrzinata_na_oddelni_smetki.pdf",1,1,2008,1,0,3,2008,1,1,2009,1,2,1,2008,0,null,"-",0,1,0,0,0,0,1,1,1,0,0,"-",0,"-",0,"-",0,"-",0,"http://www.stat.gov.mk","Macedonia State Statistical Office ","http://www.nbrm.gov.mk","National Bank of the Republic of Macedonia","-",0,"-",1,"http://www.finance.gov.mk/node/13",0,"-",0,1,"-","mac","eng","-","-",0,"TRIS","Macedonian Treasury Information System","C","T",1,2001,"C+L",1,1,"LDSW","CS","Aug 2007","Public","A","NU","C","NU","A","C","C+","C+","B","C",2.75,2.8260869565217392,35,49,1,1,70,0.55869999999999997,0.45100000000000001,0.41349999999999998,0.8115,"ECA",null,null,null,null,"Macedonia",1,null,null,null,1,0,null,null,null,null,null,16,61.53846153846154,"B",null,105,"Macedonia","MKD",2010,"<2",2006,19,12,392.13967000000002,null,null,"DAD"]
[106,null,"Madagascar","LIC",21315.134999999998,9100.2672513046491,430,"http://www.mefb.gov.mg","Madagascar Ministry of the Economy, Finance and Budget",2,"http://www.dgbudget.mg/",2,"http://www.mefb.gov.mg/index.php?option=com_content&view=article&id=329&Itemid=332",1,"-",0,"-",0,0,"-",1,1,0,"-",1,"http://www.mefb.gov.mg/textes_lois/compta_publique/decret_05210_pcop.pdf",1,1,2010,1,1,3,2010,1,1,2010,1,3,1,2010,0,null,"-",1,0,0,0,0,0,0,0,0,1,1,"http://www.armp.mg/",0,"-",0,"-",0,"-",0,"http://www.instat.mg","Madagascar National Institute of Statistics","http://www.banque-centrale.mg","Central Bank of Madagascar","-",0,"-",1,"http://www.mefb.gov.mg/index.php?option=com_wrapper&view=wrapper&Itemid=34",0,"-",1,2,"-","mlg","fre","eng","-",0,"SIGFIP","Système Intégré de Gestion des Finances Publiques","C","F",3,2011,"C+L",2,1,"LDSW > Oracle","Web","May 2008","Final","X","X","X","X","X","X","X","X","X","X",2.15,2.403225806451613,"-","-",null,2,148,0.3054,0.32029999999999997,5.1999999999999998E-2,0.54379999999999995,"AFR",null,null,null,null,"Madagascar",0,null,null,null,null,0,null,null,null,null,"2013-05-05",16,61.53846153846154,"B",null,106,"Madagascar","MDG",2010,81.3,2005,68.7,17329.204754999999,14643.497745000001,null,2009]
[107,null,"Malawi","LIC",15380.888000000001,5558.565721397089,360,"http://www.finance.gov.mw","Ministry of Finance of Malawi",2,"http://www.finance.gov.mw/index.php?option=com_docman&Itemid=114",1,"http://www.eastafritac.org/images/uploads/documents_storage/Theme_A-IFMIS_managing_risks.pdf",1,"-",0,"-",0,0,"-",1,1,0,"-",0,"-",1,1,2011,1,0,3,2011,0,null,"-",1,3,0,2005,1,1,2007,0,1,0,0,1,1,1,0,1,0,0,"-",0,"-",0,"-",0,"-",0,"http://www.nso.malawi.net","Malawi National Statistical Office ","http://www.rbm.mw","Reserve Bank of Malawi","-",0,"-",1,"http://www.finance.gov.mw/index.php?option=com_content&view=category&layout=blog&id=47&Itemid=85",0,"-",1,3,"-","eng","-","-","-","-","IFMIS","Integrated Financial Management Information System","C","F",2,2008,"C",2,2,"CODA > Epicor","CS","Mar 2011","Draft","X","X","X","X","X","X","X","X","X","X",2.2999999999999998,2.3703703703703702,52,47,0,2,159,0.27400000000000002,0.2157,3.2099999999999997E-2,0.57410000000000005,"AFR",null,null,null,null,"Malawi",0,null,null,null,null,0,null,null,null,null,null,12,46.153846153846153,"C",null,107,"Malawi","MWI",2004,73.900000000000006,2010,50.7,11366.476232000003,7798.1102160000009,null,2008]
[108,null,"Malaysia","UMIC",28859.153999999999,253043.61546574478,8770,"http://www.treasury.gov.my","Ministry of Finance/Treasury",2,"http://www.treasury.gov.my/index.php?option=com_content&view=category&id=73&Itemid=174&lang=my",2,"http://km.anm.gov.my",1,"-",0,"-",0,0,"-",1,1,0,"-",1,"http://www.treasury.gov.my/pekeliling/pp/pp032012.pdf",1,1,2004,0,null,"-","-",0,null,"-",1,4,1,2006,1,0,2011,0,1,1,1,1,0,0,0,0,0,1,"http://myprocurement.treasury.gov.my/",0,"-",0,"-",0,"-",0,"http://www.statistics.gov.my","Malaysia Department of Statistics","http://www.bnm.gov.my","Central Bank of Malaysia","-",0,"-",1,"http://www.treasury.gov.my/index.php?option=com_content&view=article&id=315%3Acarta-kementerian&catid=119%3Aprofil-kementerian&Itemid=154&lang=en",0,"-",1,3,"-","may","eng","-","-",0,"GFMAS","Government Financial and  Management Accounting System","D","F",1,2006,"C+L",1,2,"SAP","Web","-","-","-","-","-","-","-","-","-","-","-","-","-","-",39,39,null,1,40,0.67030000000000001,0.79079999999999995,0.45100000000000001,0.76910000000000001,"EAP",null,null,"APEC",null,"Malaysia",7,2,2,3,null,1,null,null,1,null,null,13,50,"B",null,108,"Malaysia","MYS",2009,"<2",2009,3.8,null,1096.6478519999998]
[109,null,"Maldives","UMIC",320.08100000000002,1831.0624457885683,5720,"http://www.finance.gov.mv","Ministry of Finance",2,"http://www.budget.gov.mv",2,"http://www.finance.gov.mv/v1/orgview?unit=Information%20Communication%20Technology%20Section",1,"-",1,"http://www.budget.gov.mv/",0,0,"-",1,1,0,"-",0,"-",1,0,2012,0,null,"-","-",0,null,"-",0,null,null,"-",0,null,"-",0,0,0,0,0,0,0,0,0,0,0,"-",0,"-",0,"-",0,"-",2,"http://www.planning.gov.mv","Department of National Planning","http://www.mma.gov.mv","Maldives Monetary Authority","http://www.finance.gov.mv/v1/datanstat?id=27",0,"-",0,"-",0,"-",0,1,"-","div","eng","-","-",0,"PAS","Public Accounting System","C","T",1,2010,"C+L",3,2,"SAP","Web","Nov 2009","Public","B","C","B","D","C","A","C+","D","D+","D",2.1,1.9482758620689655,"-","-",null,0,95,0.49940000000000001,0.32679999999999998,0.3599,0.81140000000000001,"SAR",null,null,null,null,"Maldives",0,null,null,null,null,0,null,null,null,null,null,9,34.615384615384613,"C",null,109,"Maldives","MDV",2004,"<2",null,null,null,null,null,null,"DAD"]
[110,null,"Mali","LIC",15839.538,9632.7587674317256,610,"http://www.finances.gov.ml","Mali Ministry of Economy and Finance",0,"-",0,"-",0,"-",0,"-",0,0,"-",1,1,1,"http://www.finances.gouv.ml/documentation/BUDGETCITOYEN%202012%20FINAL.pdf",0,"-",1,0,2009,0,null,"-","-",0,null,"-",1,3,0,2010,0,null,"-",1,0,1,0,0,1,1,0,1,0,0,"-",0,"-",0,"-",0,"-",0,"http://www.dnsi.gov.ml","Mali National Directorate of Statistics and Informatics ","http://www.bceao.int ","Central Bank of West African States (BCEAO)","-",0,"-",1,"http://www.finances.gouv.ml/contenu_page.aspx?pa=23",2,"GFS 1986 (not 2001)",0,0,"-","fre","-","-","-","-","-","-","C","-","-","-","-","-","-","-","-","Jun 2011","Public","B","A","C","B+","C+","B","D+","D+","D","D+",2.35,2.774193548387097,43,35,null,1,183,0.1857,0.32029999999999997,6.4500000000000002E-2,0.17230000000000001,"AFR",null,null,null,null,"Mali",0,null,null,null,null,0,null,null,null,null,null,5,19.230769230769234,"D",null,110,"Mali","MLI",2010,50.4,2010,43.6,7983.127152,6906.0385680000009]
[111,null,"Malta","HIC",419,8887,21210.023866348449,"http://www.mfin.gov.mt","Malta Ministry of Finance",2,"http://finance.gov.mt/page.aspx?site=MFIN&page=thebudget",2,"http://finance.gov.mt/page.aspx?site=MFIN&page=fdrs",2,"http://finance.gov.mt/page.aspx?site=TRS&page=publications",0,"-",0,1,"http://finance.gov.mt/image.aspx?site=TRS&ref=651&type=publication",2,1,0,"-",1,"http://finance.gov.mt/image.aspx?site=TRS&ref=391&type=publication",1,0,2000,0,null,"-","-",1,0,2012,0,null,null,"-",1,1,2007,1,1,0,0,0,1,1,1,1,0,0,"-",1,"http://www.gov.mt",0,"-",1,"http://finance.gov.mt/image.aspx?site=TRS&ref=391&type=publication",2,"http://www.nso.gov.mt","Malta National Statistics Office","http://www.centralbankmalta.org","Central Bank of Malta","http://sdw.ecb.europa.eu/browse.do?node=19111",1,"http://finance.gov.mt/page.aspx?site=TRS&page=foi",1,"http://finance.gov.mt/page.aspx?site=TRS&page=legislation",0,"National laws and regulations",0,3,"https://www.mita.gov.mt/page.aspx?pageid=221","mlt","eng","-","-",1,"DAS + FDRS","Electronic Departmental Accounting System / ","D","T",1,2005,"C",1,2,"SAGE 100","Web","-","-","-","-","-","-","-","-","-","-","-","-","-","-","-","-",1,2,35,0.71309999999999996,0.61439999999999995,0.71919999999999995,0.80569999999999997,"MNA","EU",null,null,null,"Malta",0,null,null,null,null,0,null,null,null,null,null,15,57.692307692307686,"B",null,111,"Malta","MLT"]
[112,null,"Marshall Islands","LMIC",54.816000000000003,214.33726436207886,3910,"http://www.rmigovernment.org/cabinet.jsp","Ministry of Finance",0,"-",1,"http://www.pftac.org/filemanager/files/PFM/IFMIS_PICspdf1.pdf",0,"-",0,"-",0,0,"-",0,0,0,"-",0,"-",0,null,"-",0,null,"-","-",0,null,"-",1,4,1,1997,0,null,"-",0,0,0,0,0,1,1,0,0,0,0,"-",0,"-",0,"-",0,"-",1,"http://www.spc.int/prism/country/mh/stats","Economic Policy, Planning and Statistics Office","-","Banking Commission of Marshall Islands","-",0,"-",0,"-",0,"-",0,1,"-","eng","-","-","-","-","FMIS","Financial Management Information System","C","T",1,2004,"C",1,2,"4gov","Web","Dec 2011","Draft","X","X","X","X","X","X","X","X","X","X",1.1666666666666667,1.6481481481481481,"-","-",null,1,146,0.31290000000000001,0.13730000000000001,4.2500000000000003E-2,0.75900000000000001,"EAP",null,null,null,"F","Marshall Islands",0,null,null,null,null,0,null,null,null,null,null,3,11.538461538461538,"D",null,112,"Marshall Islands","MHL"]
[113,null,"Mauritania","LIC",3541.54,3527.5427139694425,1000,"http://www.economie.gov.mr","Ministry of Economic Affair and Development",1,"http://www.economie.gov.mr/economiques/mright/Statistiques/agregat.htm",1,"http://documents.worldbank.org/curated/en/2011/05/16215662/mauritania-public-expenditure-review-update",1,"-",0,"-",0,0,"-",1,1,0,"-",0,"-",0,null,"-",0,null,"-","-",1,1,1995,1,4,1,1995,0,null,"-",1,1,0,0,0,1,1,0,0,0,0,"-",0,"-",0,"-",0,"-",1,"http://www.ons.mr","Mauritania National Statistics Office","http://www.bcm.mr","Banque Centrale de Mauritanie","-",0,"-",0,"-",0,"-",0,0,"-","fre","-","-","-","-","IFMIS","Integrated Financial Management Information System","C","T",1,2006,"C",1,1,"LDSW","CS","Jun 2008","Public","C","C","B","B","C+","D","C+","D+","D+","D+",2.0499999999999998,2.2333333333333334,"-","-",null,2,181,0.1996,7.8399999999999997E-2,0.1123,0.40789999999999998,"AFR",null,null,null,null,"Mauritania",0,null,null,null,null,0,null,null,null,null,null,9,34.615384615384613,"C",null,113,"Mauritania","MRT",2008,23.4,2008,42,828.72035999999991,1487.4467999999999,null,null,"DAD"]
[114,null,"Mauritius","UMIC",1286.0509999999999,10341.748936027463,8040,"http://mof.gov.mu/English/Pages/default.aspx","Mauritius Ministry of Finance and Economic Empowerment",2,"http://mof.gov.mu/English/National%20Budget/Pages/default.aspx",1,"http://www.gov.mu/portal/goc/mof/files/pbb22aug.pdf",1,"-",1,"http://mof.gov.mu/English/Pages/National%20Budget/national-budget-budgetary-central-government.aspx",0,0,"-",2,1,0,"-",1,"http://www.gov.mu/portal/site/MOFSite/menuitem.c84a125a4c8427861eb9d510a0208a0c/",1,1,2002,1,1,3,2004,1,1,2002,1,2,0,2008,1,1,1998,1,1,0,1,1,1,1,1,1,0,1,"http://www.gov.mu/portal/site/MOFSite/menuitem.5b1d751c6156d7f4e0aad110a7b521ca/?content_id=cb0569975e172310VgnVCM1000000a04a8c0RCRD",0,"-",0,"-",0,"-",1,"http://www.gov.mu/portal/site/cso","Mauritius Central Statistical Office","http://bom.intnet.mu","Bank of Mauritius","-",0,"-",1,"http://www.gov.mu/portal/site/MOFSite/menuitem.c84a125a4c8427861eb9d510a0208a0c/",2,"IMF's General Data Dissemination System (GDDS), http://www.gov.mu/portal/site/MOFSite/menuitem.27c9a75baa1319f4e0aad110a7b521ca/",0,2,"-","eng","-","-","-","-","FMIS","Financial Management Information System","C","F",1,2009,"C+L",1,2,"Oracle","Web","Aug 2011","Public","A","A","B","C+","A","A","A","A","B+","A",3.7,3.1774193548387095,"-","-",null,3,93,0.50660000000000005,0.43140000000000001,0.3296,0.75880000000000003,"AFR",null,null,null,null,"Mauritius",0,null,null,null,null,0,null,null,null,null,"2013-05-03",18,69.230769230769226,"B",null,114,"Mauritius","MUS"]
[115,null,"Mexico","UMIC",114793.341,1081767.7597645542,9420,"http://www.shcp.gob.mx","Secretaría de Hacienda y Crédito Público - Ministry of Finance, Mexico",2,"http://www.shcp.gob.mx/EGRESOS/PEF/Paginas/DocumentosRecientes.aspx",2,"http://www.hacienda.gob.mx/EGRESOS/contabilidad_gubernamental/manual_contabilidad/index.html",3,"http://www.shcp.gob.mx/POLITICAFINANCIERA/FINANZASPUBLICAS/Estadisticas_Oportunas_Finanzas_Publicas/Informacion_mensual/Paginas/finanzas_publicas.aspx",1,"http://www.transparenciapresupuestaria.gob.mx/ptp/contenidos/?id=17&group=Preguntas&page=%C2%BFD%C3%B3nde%20gasta?",0,1,"http://www.shcp.gob.mx/EGRESOS/PEF/pef/pef_2010/temas/tomos/40/r40_ppcer.pdf",2,1,2,"http://www.transparenciapresupuestaria.gob.mx/ptp/index.jsp",1,"http://www.shcp.gob.mx/EGRESOS/PEF/programacion/Paginas/pyp2012.aspx",1,1,2000,1,1,5,2003,1,1,2006,1,3,1,2000,1,0,2004,1,1,0,0,0,1,1,0,1,0,0,"-",1,"http://mapas.gob.mx",2,"http://www.dgi.sedesol.gob.mx/index/index.php?sec=64&pagina=3",0,"-",0,"http://www.inegi.gob.mx","Mexico National Institute of Statistics, Geography, and Informatics","http://www.banxico.org.mx","Bank of Mexico","-",1,"http://www.transparenciapresupuestaria.gob.mx/ptp/index.jsp",1,"http://www.shcp.gob.mx/LASHCP/Paginas/visionMision.aspx",2,"-",0,1,"-","spa","eng","-","-",0,"SIDAFF","Sistema Integrado de Administración Financiera Federal","C","F",3,2012,"C",1,2,"Oracle","Web","-","-","-","-","-","-","-","-","-","-","-","-","-","-",61,52,1,1,55,0.624,0.73199999999999998,0.31040000000000001,0.82950000000000002,"LCR",null,"OECD","APEC",null,"Mexico",3,1,1,null,1,0,null,null,null,null,null,24,92.307692307692307,"A",null,115,"Mexico","MEX",2010,"<2",2010,51.3,null,58888.983932999996]
[116,null,"Micronesia, Fed. Sts.","LMIC",111.542,318.64581438392742,2860,"http://www.fsmgov.org/ngovt.html","Dept of Finance and Administration",1,"http://www.sboc.fm/index.php?id1=Vm0xMGFtVkhVWGhhU0U1U1lrVndVbFpyVWtKUFVUMDk",1,"http://www.mra.fm/pdfs/news_StrategicPlan.pdf",1,"-",0,"-",0,0,"-",1,1,0,"-",0,"-",1,0,2006,0,null,"-","-",0,null,"-",1,4,1,1995,1,1,2006,0,0,0,0,0,1,1,0,0,0,0,"-",0,"-",0,"-",0,"-",1,"http://www.sboc.fm","Office of SBOC (Statistics, Budget and Economic Management, Overseas Dev Assistance and Compact Mgmt)","-","National Bank of the Federated States of Micronesia","-",0,"-",0,"-",2,"-",0,1,"-","eng","-","-","-","-","FMIS","Financial Management Information System","C","F",4,2014,"C",1,0,"?","Web","Jan 2012","Draft","X","X","X","X","X","X","X","X","X","X",1.7222222222222223,1.8653846153846154,"-","-",null,"-",127,0.38119999999999998,0.2092,0.1013,0.83320000000000005,"EAP",null,null,null,"F","Micronesia, Fed. Sts.",0,null,null,null,null,0,null,null,null,null,null,10,38.461538461538467,"C",null,116,"Micronesia, Fed. Sts.","FSM",2000,31.2,null,null,34.801104000000002]
[117,null,"Moldova","LMIC",3559,7055.8586604291295,1980,"http://www.mf.gov.md","Moldova Ministry of Finance",2,"http://www.mf.gov.md/ro/raportinfo/budget/",2,"http://www.mf.gov.md/ro/delurproject/proiect1",1,"-",0,"-",0,1,"http://www.mf.gov.md/common/raportinfo/budget/national/lun/Anul2010/decembrie_2010/1Informatia_operativa_privind_executarea_bugetului_public_national.pdf",2,1,0,"-",1,"http://www.mf.gov.md/ro/raportinfo/GFS/",1,1,2004,1,1,3,2007,0,null,"-",1,4,1,2006,1,1,2008,1,1,0,0,0,1,1,0,1,0,0,"-",1,"http://data.gov.md",0,"-",1,"http://www.mf.gov.md/ro/raportinfo/GFS/",3,"http://www.statistica.md","Moldova National Bureau of Statistics","http://www.bnm.org","National Bank of Moldova","http://www.mf.gov.md/ro/BOOST/",0,"-",1,"http://www.mf.gov.md/ro/about/organigrama/",2,"-",0,3,"-","rom","eng","-","-",0,"FMIS","Financial Management Information System","C","F",3,2012,"C+L",1,2,"SAP + LDSW","Web","Oct 2011","Final","X","X","X","X","X","X","X","X","X","X",3.35,3.193548387096774,"-","-",1,2,69,0.56259999999999999,0.51629999999999998,0.35859999999999997,0.81289999999999996,"ECA",null,null,null,null,"Moldova",0,null,null,null,null,0,null,null,null,null,null,18,69.230769230769226,"B",null,117,"Moldova","MDA",2010,"<2",2010,21.9,14,779.42099999999994,null,2014]
[118,null,"Monaco","HIC",35.427,6109,172439.10012137637,"http://www.gouv.mc/Gouvernement-et-Institutions/Le-Gouvernement/Departement-des-Finances-et-de-l-Economie","Dept of Finance and Economy",0,"http://www.gouv.mc/Action-Gouvernementale/L-Economie/Analyses-et-Statistiques/Economie-et-Finance",0,"-",0,"-",0,"-",0,0,"-",1,0,0,"-",0,"-",0,null,"-",0,null,"-","-",0,null,"-",1,3,1,2009,0,null,"-",0,1,0,0,0,0,0,0,0,0,0,"-",0,"-",0,"-",0,"-",1,"http://www.gouv.mc/Action-Gouvernementale/L-Economie/Analyses-et-Statistiques","Monegasque Institute of Statistics and Economic Studies","http://www.ecb.int","European Central Bank","-",0,"-",1,"http://www.gouv.mc/Gouvernement-et-Institutions/Le-Gouvernement",0,"-",0,3,"-","fre","eng","-","-",0,"-","-","D","-","-","-","-","-","-","-","-","-","-","-","-","-","-","-","-","-","-","-","-","-","-","-","-",null,"-",26,0.74680000000000002,0.35949999999999999,0.93700000000000006,0.94389999999999996,null,"EUR",null,null,null,"Monaco",0,null,null,null,null,0,null,null,null,null,null,3,11.538461538461538,"D",null,118,"Monaco","MCO"]
[119,null,"Mongolia","LMIC",2800.114,6457.9183035037086,2310,"http://www.mof.gov.mn","Mongolia Ministry of Finance",2,"http://www.mof.gov.mn/page/?lan=en&c=292450",2,"http://www.mof.gov.mn/page/?lan=mn",1,"-",0,"-",0,0,"-",1,1,0,"-",0,"-",1,1,2007,0,null,"-","-",0,null,"-",1,4,1,2007,0,null,"-",0,0,0,0,0,0,0,0,0,0,1,"http://www.e-procurement.mn/",0,"-",0,"-",0,"-",0,"http://www.nso.mn","Mongolia National Statistical Office","http://www.mongolbank.mn","Bank of Mongolia","-",0,"-",1,"http://www.mof.gov.mn/page/?lan=en&c=45053",0,"-",0,3,"-","rus","eng","-","-",0,"GFMIS","Government Financial Management Information System","C","T",3,2005,"C+L",1,2,"FreeBalance","Web","-","-","-","-","-","-","-","-","-","-","-","-","-","-",51,60,0,1,76,0.54430000000000001,0.58819999999999995,0.17580000000000001,0.86880000000000002,"EAP",null,null,null,null,"Mongolia",0,null,null,null,null,0,null,null,null,null,null,11,42.307692307692307,"C",null,119,"Mongolia","MNG",null,null,2010,39.200000000000003,null,1097.6446880000001]
[120,null,"Montenegro","UMIC",632.26099999999997,4516.7463368248409,7140,"http://www.mf.gov.me","Montenegro Ministry of Finance",1,"http://www.mf.gov.me/organizacija/bud%C5%BEet-i-trezor-",1,"http://www.questionnaire.gov.me/O/Pdf/C32.pdf",1,"-",0,"-",0,0,"-",1,0,0,"-",0,"-",0,null,"-",0,null,"-","-",0,null,"-",1,4,1,2005,0,null,"-",0,0,0,0,0,1,1,0,0,0,0,"-",0,"-",0,"-",1,"http://www.undp.org.me/files/reports/ijr/Annex%201%20Report%20on%20Budgeting%20in%20Montenegro.pdf",2,"http://www.monstat.org","Statistical Office of the Republic of Montenegro","http://www.cb-mn.org","Central Bank of Montenegro","http://www.gov.me/WebResources/budget2012/predlog.html",1,"http://www.gov.me/info_vodici",1,"http://www.mf.gov.me/organizacija",2,"-",0,3,"-","mnt","rus","eng","-",0,"TS","Treasury System","C","T",1,2003,"C+L",1,2,"SAP","Web","Jul 2009","Public","B","B","A","C+","A","A","C+","C+","C+","C",3,2.7166666666666668,"-","-",1,0,57,0.62180000000000002,0.50980000000000003,0.53749999999999998,0.81820000000000004,"ECA",null,null,null,null,"Montenegro",0,null,null,null,null,0,null,null,null,null,null,6,23.076923076923077,"D",null,120,"Montenegro","MNE",2010,"<2",2011,9.3000000000000007,1,58.800272999999997]
[121,null,"Morocco","LMIC",32272.973999999998,97618.967684052026,2970,"http://www.finances.gov.ma","Morocco Ministry of Finance and Privatization",2,"http://www.finances.gov.ma/portal/page?_pageid=53,17812975&_dad=portal&_schema=PORTAL",2,"https://www.tgr.gov.ma/wps/portal",1,"-",1,"http://www.finances.gov.ma/portal/page?_pageid=53,17812975&_dad=portal&_schema=PORTAL",0,0,"-",1,1,1,"http://www.finances.gov.ma/portal/page?_pageid=53,17814589&_dad=portal&_schema=PORTAL&id=1041&lang=Fr",1,"http://www.finances.gov.ma/esp_doc/util/file.jsp?iddoc=2404",1,0,2009,0,null,"-","-",0,null,"-",1,2,1,2005,0,null,"-",1,1,0,1,0,1,1,0,1,0,1,"http://www.finances.gov.ma/portal/page?_pageid=53,18106174&_dad=portal&_schema=PORTAL",1,"http://data.gov.ma",0,"-",0,"-",0,"http://www.insea.ac.ma","Direction de la Statistique","http://www.bkam.ma","Bank of Morocco","-",0,"-",1,"http://www.finances.gov.ma/portal/page?_pageid=53,17813153&_dad=portal&_schema=PORTAL",0,"-",0,2,"Twitter","ara","fre","eng","-",0,"GID","Gestion Intégrée de la Dépense / Integrated Expenditure Control System","C","T",1,2010,"C",1,1,"LDSW > Oracle","Web","May 2009","Public","A","B","A","C+","A","B","B+","D+","D+","D+",2.85,2.9833333333333334,38,28,null,1,120,0.4209,0.54249999999999998,0.2772,0.443,"MNA",null,null,null,null,"Morocco",0,null,null,null,null,0,null,null,null,null,null,13,50,"B",null,121,"Morocco","MAR",2007,2.5,2007,9,806.82434999999998,2904.5676600000002]
[122,null,"Mozambique","LIC",23929.707999999999,11239.565017551506,470,"http://www.mf.gov.mz","Mozambique National Treasury Directorate Ministry of Planning and Financ",2,"http://www.mf.gov.mz/web/guest/documentos",1,"http://www.sida.se/Documents/Import/pdf/0429-Mozambique-State-Financial-Management-Project-SFMP.pdf",1,"-",0,"-",0,0,"-",1,1,0,"-",1,"http://www.mf.gov.mz/web/guest/documentos?p_p_id=20&p_p_lifecycle=0&p_p_state=maximized&p_p_mode=view&_20_struts_action=%2Fdocument_library%2Fview&_20_folderId=19175",1,0,2007,0,null,"-","-",0,null,"-",1,2,1,2008,0,null,"-",1,1,0,0,0,1,1,1,1,0,0,"-",0,"-",2,"http://www.sida.se/Documents/Import/pdf/0429-Mozambique-State-Financial-Management-Project-SFMP.pdf",0,"-",2,"http://www.ine.gov.mz","Mozambique National Institute of Statistics ","http://www.bancomoc.mz ","Bank of Mozambique","http://www.mf.gov.mz/web/guest/documentos;jsessionid=93FA765FDFD0FECE652D2E2B3151A7F2",0,"-",1,"http://www.mf.gov.mz/web/guest/missao",0,"National laws and regulations",0,2,"-","por","-","-","-","-","e-SISTAFE","State Financial Administration System","C","F",1,2010,"C",1,2,"Oracle","Web","Mar 2011","Final","X","X","X","X","X","X","X","X","X","X",2.5499999999999998,2.838709677419355,47,28,null,2,158,0.27860000000000001,0.36599999999999999,4.4299999999999999E-2,0.42549999999999999,"AFR",null,null,null,null,"Mozambique",0,null,null,null,null,0,null,null,null,null,null,10,38.461538461538467,"C",null,122,"Mozambique","MOZ",2008,59.6,2009,54.7,14262.105968,13089.550276,null,2009,"DAD"]
[123,null,"Myanmar","LIC",48336.762999999999,872.33676300000002,824,"http://www.mofr.gov.mm","Ministry of Finance and Revenue",0,"-",0,"-",0,"-",0,"-",0,0,"-",0,0,0,"-",0,"-",0,null,"-",0,null,"-","-",0,null,"-",0,null,null,"-",0,null,"-",0,0,0,0,0,0,0,0,0,0,0,"-",0,"-",0,"-",0,"-",0,"http://www.csostat.gov.mm","Central Statistical Organization","http://www.mofr.gov.mm/dept_cbm.html","Central Bank of Myanmar","-",0,"-",1,"http://www.mofr.gov.mm/dept_bud_02.html",0,"-",0,0,"-","bur","eng","-","-",0,"-","-","C","-","-","-","-","-","-","-","-",2013,"-","-","-","-","-","-","-","-","-","-","-","-","-",0,"-",null,0,160,0.27029999999999998,0.1046,0,0.70640000000000003,"EAP",null,null,null,"F","Myanmar",0,null,null,null,null,0,null,null,null,null,"2013-04-15",0,0,"D",null,123,"Myanmar","MMR"]
[124,null,"Namibia","UMIC",2324.0039999999999,10934.076459710781,4700,"http://www.mof.gov.na","Namibia Ministry of Finance",2,"http://www.mof.gov.na/budget.htm",1,"http://www.mof.gov.na/ifms.htm",1,"-",0,"-",0,0,"-",1,1,1,"http://www.mof.gov.na",1,"http://www.mof.gov.na/Budget%20Documents/Budget%202012/Budget%20new/Estimate%20of%20Revenue%20%20and%20expenditure%201%20April%202012%20to%2031%20March%202015.pdf",1,1,2004,1,1,4,2005,1,1,2004,1,4,1,2004,1,1,2008,0,1,0,0,0,1,1,0,1,0,0,"-",0,"-",0,"-",0,"-",0,"http://www.npc.gov.na/cbs","Nepal Central Bureau of Statistics","http://www.bon.com.na","Bank of Namibia","-",0,"-",1,"http://www.mof.gov.na/Organo_new1.pdf",0,"-",0,2,"-","eng","osh","afr","ger",0,"IFMS","Integrated Financial Management System","C","T",1,2006,"C",1,2,"Oracle","Web","Nov 2008","Final","X","X","X","X","X","X","X","X","X","X",2.8,2.7,55,53,null,3,123,0.39369999999999999,0.30070000000000002,0.13850000000000001,0.7419,"AFR",null,null,null,null,"Namibia",0,null,null,null,null,0,null,null,null,null,null,18,69.230769230769226,"B",null,124,"Namibia","NAM",2004,31.9,2009,28.7,741.35727599999996,666.989148]
[125,null,"Nauru","LMIC",9.3219999999999992,36.9,3958.3780304655652,"http://www.gov.nr","Ministry of Finance",0,"-",0,"-",0,"-",0,"-",0,0,"-",0,0,0,"-",0,"-",0,null,"-",0,null,"-","-",0,null,"-",0,null,null,"-",0,null,"-",0,0,0,0,0,0,0,0,0,0,0,"-",0,"-",0,"-",0,"-",1,"http://www.spc.int/prism/country/nr/stats","Nauru Bureau of Statistics","www.cbm.gov.mm","Central Bank of Myanmar","-",0,"-",0,"-",0,"-",0,0,"-","eng","-","-","-","-","-","-","C","-","-","-","-","-","-","-","-","Dec 2010","Draft","X","X","X","X","X","X","X","X","X","X",1.625,1.7173913043478262,"-","-",null,"-",141,0.32419999999999999,9.8000000000000004E-2,0.17,0.70469999999999999,"EAP",null,null,null,null,"Nauru",0,null,null,null,null,0,null,null,null,null,null,0,0,"D",null,125,"Nauru","NRU"]
[126,null,"Nepal","LIC",30485.797999999999,16600.963532453519,540,"http://www.mof.gov.np","Nepal Ministry of Finance",1,"http://www.mof.gov.np/publication/index.php",1,"http://www-wds.worldbank.org/external/default/WDSContentServer/WDSP/IB/2012/02/06/000386194_20120206020352/Rendered/PDF/666480PJPR0P120200201100for0public.pdf",1,"-",0,"-",0,0,"-",2,1,0,"-",0,"-",1,1,2002,1,0,3,2011,0,null,"-",1,4,1,2002,1,1,2007,1,1,0,1,1,1,1,0,1,0,0,"-",0,"-",0,"-",0,"-",0,"http://www.cbs.gov.np","Nepal Central Bureau of Statistics","http://www.nrb.org.np","Central Bank of Nepal","-",0,"-",1,"http://www.mof.gov.np/contentArticle-Content-cWo=#",0,"-",0,3,"-","nep","eng","-","-",0,"CTS","Core Treasury System","C","T",3,2015,"C+L",1,0,"LDSW > Oracle","Web","Feb 2008","Public","C","B","B","C+","C+","C","C+","C+","D+","D",2.25,2.096774193548387,44,45,null,2,164,0.26640000000000003,0.28760000000000002,5.9700000000000003E-2,0.4521,"SAR",null,null,null,"F","Nepal",0,null,null,null,null,0,null,null,null,null,null,13,50,"B",null,126,"Nepal","NPL",2010,24.8,2011,25.2,7560.4779039999994,7682.421096,null,2010]
[127,null,"Netherlands","HIC",16696,829013.18712922558,49650,"http://www.government.nl/ministries/fin","Ministerie van Financiën - Finance Ministry, Netherlands",2,"http://www.rijksbegroting.nl/",1,"http://www.oecd.org/netherlands/43411548.pdf",2,"http://www.prinsjesdag2011.nl/miljoenennota/effect_op_u",1,"http://opendata.rijksbegroting.nl/",0,1,"-",2,1,1,"http://www.begrotingsspel.nl/#",1,"http://www.rbv.minfin.nl",1,1,1911,1,1,5,2007,0,null,"-",1,4,1,2007,1,1,2005,0,1,0,0,0,1,0,0,0,0,0,"-",1,"http://data.overheid.nl",0,"-",0,"-",3,"http://www.cbs.nl","Statistics Netherlands","http://www.dnb.nl ","Netherlands Bank","http://www.prinsjesdag2011.nl/miljoenennota",1,"http://www.government.nl/accessibility",1,"http://www.rijksoverheid.nl/ministeries/fin/organisatie/organogram",0,"-",1,3,"-","dut","eng","-","-",0,"IBOS","National Budget Information System","D","F",1,2003,"C+L",1,1,"LDSW","Web","-","-","-","-","-","-","-","-","-","-","-","-","-","-","-","-",1,3,2,0.91249999999999998,0.96079999999999999,0.83420000000000005,0.9425,null,"EU","OECD",null,null,"Netherlands",6,2,null,3,1,4,1,null,3,null,"2013-04-04",20,76.923076923076934,"A",null,127,"Netherlands","NLD"]
[128,null,"New Zealand","HIC",4405.2,159700,36252.610551166807,"http://www.treasury.govt.nz","New Zealand Treasury",2,"http://www.treasury.govt.nz/government/financialstatements",2,"http://www.treasury.govt.nz/publications/guidance/reporting/cfisnet",1,"-",1,"http://www.treasury.govt.nz/budget/2012/data",1,1,"http://www.treasury.govt.nz/budget/2012/data",2,1,2,"http://www.treasury.govt.nz/budget/app",1,"http://www.treasury.govt.nz/government/financialstatements/yearend/archive",1,1,1997,1,1,4,1992,1,1,2000,1,2,1,2000,1,1,1994,1,1,0,0,0,1,"n/a",1,1,1,1,"http://www.treasury.govt.nz/government/data",1,"http://www.data.govt.nz",0,"-",0,"-",3,"http://www.stats.govt.nz","Statistics New Zealand ","http://www.rbnz.govt.nz","Reserve Bank of New Zealand","http://www.treasury.govt.nz/government/data",1,"http://www.treasury.govt.nz/publications/guidance/reportingcalendar",1,"http://www.treasury.govt.nz/abouttreasury",2,"GFS 2001 + International Financial Reporting Standards.",1,3,"-","eng","-","-","-","-","CFISnet","Financial Management Information System","D","F",1,1999,"C+L",1,2,"Various","Web","-","-","-","-","-","-","-","-","-","-","-","-","-","-",93,90,null,3,13,0.83809999999999996,0.7843,0.73180000000000001,0.99819999999999998,null,"PAC","OECD","APEC",null,"New Zealand",0,null,null,null,null,0,null,null,null,null,"2013-04-17",24,92.307692307692307,"A",null,128,"New Zealand","NZL"]
[129,null,"Nicaragua","LMIC",5869.8590000000004,8873.9650770532953,1510,"http://www.hacienda.gob.ni","Nicaragua Ministry of Finance and Public Credit",2,"http://www.hacienda.gob.ni/documentos/presupuesto/presupuesto-gral.-de-la-republica",2,"http://www.hacienda.gob.ni/Direcciones/tecnologia/hacienda/Direcciones/tecnologia/aplicaciones",2,"http://www.transmuni.gob.ni",0,"-",1,1,"http://www.transmuni.gob.ni/cgi-bin/tm_CPTKtal.cgi?ejercicio=2013",2,1,2,"http://www.consultaciudadana.gob.ni/cciudadana/index.jsp",1,"http://www.hacienda.gob.ni/documentos/presupuesto/informes/2012/Informe%20de%20Liquidacion%20del%20Presupuesto%20General%20de%20la%20Republica%202012.pdf/view",1,1,2005,1,1,4,2006,1,1,1997,1,2,1,1998,1,1,2005,1,0,0,0,0,1,1,1,0,0,1,"http://www.transmuni.gob.ni",0,"-",2,"http://www.hacienda.gob.ni/Direcciones/tecnologia/hacienda/Direcciones/tecnologia/aplicaciones",1,"http://www.hacienda.gob.ni/Direcciones/tecnologia/hacienda/Direcciones/tecnologia/aplicaciones",1,"http://www.inide.gob.ni","Instituto Nacional de Información de Desarrollo / National Institute of Development Information","http://www.bcn.gob.ni","Central Bank of Nicaragua","-",0,"-",1,"http://www.hacienda.gob.ni/Ministerio",0,"-",1,1,"-","spa","eng","-","-",0,"SIGFA","Sistema Integrado de Gestión Financiera","C","F",1,2009,"C+L",2,1,"LDSW > Oracle","CS","Dec 2006","Draft","X","X","X","X","X","X","X","X","X","X",2.1666666666666665,2.4629629629629628,42,37,null,2,130,0.36209999999999998,0.31369999999999998,0.11940000000000001,0.65329999999999999,"LCR",null,null,null,null,"Nicaragua",0,null,null,null,null,0,null,null,null,null,"2013-04-22",{"$f":"J131+L131+N131+P131+R131+S131+U131+V131+W131+Y131+AA131+AB131+AD131+AE131+AH131+AI131+AK131+AM131+AO131+AP131","v":24},92.307692307692307,"A",null,129,"Nicaragua","NIC",2005,11.9,2009,42.5,698.51322100000004,2494.690075]
[130,null,"Niger","LIC",16068.994000000001,5794.6088586232745,360,"http://www.presidence.ne/index.php/le-gouvernement","Niger Ministry of Economy & Finance",0,"-",0,"-",0,"-",0,"-",0,0,"-",0,0,0,"-",0,"-",0,null,"-",0,null,"-","-",0,null,"-",0,null,null,"-",0,null,"-",1,1,0,0,0,0,0,0,0,0,0,"-",0,"-",0,"-",0,"-",0,"http://www.stat-niger.org","Niger Institut National de la Statistique","http://www.bceao.int ","Central Bank of West African States (BCEAO)","-",0,"-",0,"-",0,"-",0,1,"-","fre","-","-","-","-","-","-","C","-","-","-","-","-","-","-","-","Dec 2008","Public","C","D","C","C","D","D","D+","C+","D","C+",1.65,1.9838709677419355,4,3,null,1,188,0.1119,0.1961,2.93E-2,0.1103,"AFR",null,null,null,null,{"$f":"C132","v":"Niger"},{"$f":"SUM(DS132:DV132)","v":0},null,null,null,null,{"$f":"SUM(DX132:EA132)","v":0},null,null,null,null,null,0,{"$f":"EC132/26*100","v":0},{"$f":"IF(ED132<25,\"D\",IF(ED132<50,\"C\",IF(ED132<75,\"B\",\"A\")))","v":"D"},null,130,"Niger","NER",2008,43.6,2007,59.5,7006.081384000001,9561.0514299999995,null,2009]
[131,null,"Nigeria","LMIC",162470.73699999999,207278.46413598882,1280,"http://www.fmf.gov.ng","Nigeria Federal Ministry of Finance",1,"http://www.budgetoffice.gov.ng/publications.html",2,"http://www.gifmis.gov.ng/gif-mis/index.php?option=com_content&view=article&id=2&Itemid=2",1,"-",0,"-",0,0,"-",1,1,1,"http://www.budgetoffice.gov.ng/2012_appropriation_act/A%20CITIZEN'S%20GUIDE%20TOTHE%20FGN%20BUDGET.pdf",0,"-",1,0,2008,1,0,3,2010,0,null,"-",1,3,0,2009,0,null,"-",1,1,0,0,0,1,0,0,0,0,0,"-",0,"-",0,"-",0,"-",0,"http://www.nigerianstat.gov.ng","Nigeria National Bureau of Statistics","http://www.cenbank.org","Central Bank of Nigeria","-",0,"-",0,"-",0,"-",0,1,"-","eng","-","-","-","-","GIFMIS","Government Integrated Financial Management Information System","C","F",3,2012,"C+L",1,2,"SAP + LDSW","Web",2013,"-","-","-","-","-","-","-","-","-","-","-","-","-",16,18,null,1,162,0.2676,0.22220000000000001,0.127,0.45350000000000001,"AFR",null,null,null,null,"Nigeria",0,null,null,null,null,0,null,null,null,null,null,10,38.461538461538467,"C",null,131,"Nigeria","NGA",2010,68,2010,62.6,110480.10116000001,101706.681362,null,null,"DAD"]
[132,null,"Norway","HIC",4952,440185.40944412659,88890,"http://www.regjeringen.no","Ministry of Finance",2,"http://www.statsbudsjettet.no/default.aspx?id=58965",2,"http://www.dfo.no/no/Tjenester/Driftsstatus",1,"-",1,"http://www.statsbudsjettet.no/Statsbudsjettet-2011/Dokumenter/Tallene-bak-figurene/",0,0,"-",2,1,1,"http://www.ungokonomi.no/",1,"http://www.dfo.no/no/Forvaltning/Standard-kontoplan/",1,1,2001,1,1,3,2007,0,null,"-",1,2,1,1991,1,1,1997,1,1,0,0,0,1,1,1,1,0,1,"http://www.regjeringen.no/nb/dep/fin/dok/veiledninger_brosjyrer/2012/lommebudsjettet-2011.html?id=673567, http://www.peppol.eu/",1,"http://data.norge.no",0,"-",0,"-",3,"http://www.ssb.no","Statistics Norway ","http://www.norges-bank.no","Norges Bank","http://www.dfo.no/no/Forvaltning/Statsregnskapet/",1,"http://www.ub.uio.no/ujur/ulovdata/lov-20060519-016-eng.pdf",1,"http://www.regjeringen.no/en/dep/fin/the-ministry.html?id=221",2,"GFS 2001",1,3,"-","nor","smi","eng","-",0,"FMIS","Financial Management Information System","D","F",3,2013,"C+L",1,2,"Agresso + SAP","Web","Jun 2008","Public","A","A","B","C+","B+","D","C+","A","B+","NA",3.1111111111111112,3.4107142857142856,83,83,1,3,8,0.85929999999999995,0.85619999999999996,0.78700000000000003,0.93469999999999998,null,"EUR","OECD",null,null,"Norway",5,1,1,2,1,2,1,null,1,null,"2013-04-29",19,73.076923076923066,"B",null,132,"Norway","NOR"]
[133,null,"Oman","HIC",2846.145,71780,25220.078386730122,"http://www.mof.gov.om","Oman Ministry of Finance",1,"http://www.mof.gov.om/p_balance.aspx",2,"http://www.ita.gov.om/ITAPortal/eServices/info_C1.aspx?NID=74",1,"-",1,"http://www.mof.gov.om/p_balance.aspx",0,0,"-",2,1,0,"-",0,"-",1,1,2007,0,null,"-","-",0,null,"-",1,4,1,2007,0,null,"-",0,1,1,0,0,0,1,1,0,0,0,"-",0,"-",0,"-",0,"-",1,"http://www.moneoman.gov.om","Oman Ministry of National Economy","http://www.cbo-oman.org","Central Bank of Oman","-",0,"-",1,"http://www.mof.gov.om/a_chart.aspx",0,"-",0,3,"-","ara","-","-","-","-","IFS","Integrated Financial System","C","T",1,2011,"C",1,1,"LDSW ?","Web","-","-","-","-","-","-","-","-","-","-","-","-","-","-","-","-",null,0,64,0.59440000000000004,0.66669999999999996,0.39419999999999999,0.72240000000000004,"MNA",null,null,null,null,"Oman",0,null,null,null,null,0,null,null,null,null,null,12,46.153846153846153,"C",null,133,"Oman","OMN"]
[134,null,"Pakistan","LMIC",176745.364,198004.34249712748,1120,"http://www.finance.gov.pk","Pakistan Ministry of Finance",1,"http://www.finance.gov.pk/fb_2011_12.html",2,"http://www.pifra.gov.pk",1,"-",0,"-",0,0,"-",2,1,0,"-",0,"-",1,1,2009,1,1,3,2003,0,null,"-",1,4,1,2001,0,null,"-",1,1,0,0,1,1,1,1,0,0,1,"http://www.ppra.org.pk/",0,"-",0,"-",0,"-",2,"http://www.statpak.gov.pk","Pakistan Statistics Division","http://www.sbp.org.pk","State Bank of Pakistan","http://www.mtbfpakistan.gov.pk/aboutus-overview.htm",0,"-",0,"-",0,"-",0,3,"-","eng","-","-","-","-","FABS","Financial Accounting & Budgeting System","C","T",1,2011,"C+L",2,2,"SAP","Web","Jun 2009","Public","A","B","C","C+","C+","B","C+","B+","C+","C+",2.8,2.5499999999999998,58,38,null,1,156,0.2823,0.36599999999999999,0.1239,0.35720000000000002,"SAR",null,null,null,null,"Pakistan",4,3,null,1,null,0,null,null,null,null,null,13,50,"B",null,134,"Pakistan","PAK",2008,21,2006,22.3,37116.526440000001,39414.216172,null,null,"DAD"]
[135,null,"Palau","UMIC",20.609000000000002,134.1521938041669,6510,"http://www.palauembassy.com","Palau Ministry of Finance",0,"-",0,"-",0,"-",0,"-",0,0,"-",0,0,0,"-",0,"-",0,null,"-",0,null,"-","-",0,null,"-",0,null,null,"-",0,null,"-",0,0,0,0,0,0,0,0,0,0,0,"-",0,"-",0,"-",0,"-",1,"http://www.palaugov.net/stats","Palau Office of Planning & Statistics","http://www.ropfic.org/banks.html","Financial Institutions Commission / no Central Bank","-",0,"-",1,"http://www.palaugov.net/stats/PalauStats/aboutus/aboutops.htm#",0,"-",0,2,"-","eng","-","-","-","-","-","-","C","-","-","-","-","-","-","-","-",2013,"-","-","-","-","-","-","-","-","-","-","-","-","-","-","-",null,"-",113,0.43590000000000001,0.183,0.2802,0.84450000000000003,"EAP",null,null,null,null,"Palau",0,null,null,null,null,0,null,null,null,null,null,0,0,"D",null,135,"Palau","PLW"]
[136,null,"Panama","UMIC",3571.1849999999999,26665.338639822487,7470,"https://www.mef.gob.pa","Panama Ministry of Economy and Finance",1,"https://www.mef.gob.pa/Portal/DocumentosInteres.html",2,"http://www.mef.gob.pa/es/servicios/Paginas/versionesdelsiafpa.aspx",1,"-",0,"-",0,0,"-",1,1,0,"-",0,"-",1,0,2010,0,null,"-","-",0,null,"-",1,2,0,2010,0,null,"-",1,1,0,0,0,0,0,0,0,0,0,"-",0,"-",0,"-",0,"-",3,"http://www.contraloria.gob.pa","Panama Census and Statistics Directorate","http://www.banconal.com.pa","National Bank of Panama / no CB","http://sipresweb.mef.gob.pa/diprena_web/plantilla1.asp?parm1=1&parm2=1&session=711065328&retrieval=",0,"-",1,"https://www.mef.gob.pa/Portal/index.html",0,"National laws and regulations",0,2,"-","spa","-","-","-","-","SIAFPA","Financial Management Information System","C","F",3,2016,"C",2,0,"SAP","Web",2013,"-","-","-","-","-","-","-","-","-","-","-","-","-","-","-",1,0,66,0.57330000000000003,0.46410000000000001,0.44080000000000003,0.81510000000000005,"LCR",null,null,null,null,"Panama",0,null,null,null,null,0,null,null,null,null,null,8,30.76923076923077,"C",null,136,"Panama","PAN",2010,6.6,2008,32.700000000000003,235.69820999999999,1167.777495]
[137,null,"Papua New Guinea","LMIC",7013.8289999999997,10386.569070352309,1480,"http://www.finance.gov.pg/Website%20Documents/Finance%20Ministry.htm","Papua New Guinea Department of Finance",1,"http://www.treasury.gov.pg/html/national_budget/national_budget.html",1,"http://www.treasury.gov.pg/html/national_budget/files/2012/budget_documents/Related%20Budget%20Documents/2011.final.budget.outcome.pdf",1,"-",0,"-",0,0,"-",1,1,0,"-",0,"-",1,1,2007,1,0,5,2008,1,0,2008,1,3,1,2007,0,null,"-",1,1,0,0,0,1,1,1,1,0,0,"-",0,"-",0,"-",0,"-",2,"http://www.spc.int/prism/country/pg/stats","Papua New Guinea National Statistical Office","http://www.bankpng.gov.pg ","Bank of Papua New Guinea","http://www.treasury.gov.pg/html/national_budget/national_budget.html",0,"-",1,"http://www.treasury.gov.pg/about_us.html",2,"-",0,2,"-","eng","-","-","-","-","IFMS","Integrated Financial Management System","C","T",1,2011,"C",1,0,"?","Web","Mar 2009","Draft","X","X","X","X","X","X","X","X","X","X",2.25,2.2758620689655173,56,57,null,1,177,0.2147,0.2288,4.1099999999999998E-2,0.37430000000000002,"EAP",null,null,"APEC",null,"Papua New Guinea",0,null,null,null,null,0,null,null,null,null,null,11,42.307692307692307,"C",null,137,"Papua New Guinea","PNG",1996,35.799999999999997,null,null,2510.9507819999994,null,null,null,"DAD"]
[138,null,"Paraguay","LMIC",6568.29,19827.057394945001,3020,"http://www.hacienda.gov.py","Ministerio de Hacienda / Ministry of Finance",2,"http://www.hacienda.gov.py/web-presupuesto/index.php?c=192",2,"http://www.hacienda.gov.py/web-presupuesto/index.php?c=147",2,"http://www.hacienda.gov.py/web-presupuesto/index.php?c=40",0,"-",0,1,"http://www.hacienda.gov.py/web-presupuesto/archivo.php?a=9aa9ab9eacaea9ae9eacada8596b696972689da2aca9a8aca29ca2a8a79eac596b69697268a09aacada8ac68a06a6a66696a67a99d9f9a039&x=c4c4063&y=dddd07c",2,1,1,"http://www.hacienda.gov.py/web-hacienda/index.php?c=486",1,"http://www.hacienda.gov.py/web-presupuesto/index.php?c=200",1,1,2005,1,1,3,2006,1,1,2009,1,4,1,1997,1,1,2006,1,1,0,1,1,1,1,1,1,1,1,"http://www.economia.gov.py",0,"-",1,"http://websiare.hacienda.gov.py",1,"http://www.hacienda.gov.py/web-contabilidad/archivo.php?a=d9e1e6eceae7dceddbdbe1e7e698d9e498e5d9e6edd9e498dcdd98e8eae7dbdddce1e5e1dde6ece7eba6e8dcded9078&x=6b6b00a&y=808001f",0,"http://www.dgeec.gov.py","Paraguay General Directorate of Statistics, Surveys and Censuses ","http://www.bcp.gov.py","Central Bank of Paraguay","http://www.economia.gov.py",0,"-",1,"http://www.hacienda.gov.py/web-contabilidad/index.php?c=298",2,"GFS 1986",0,3,"-","spa","-","-","-","-","SIAF","Sistema Integrado de Administración Financiera","C","F",3,2012,"C+L",1,2,"Oracle","Web","Mar 2011","Draft","X","X","X","X","X","X","X","X","X","X",2.25,2.532258064516129,"-","-",1,1,104,0.48020000000000002,0.45750000000000002,0.1968,0.78620000000000001,"LCR",null,null,null,null,"Paraguay",1,1,null,null,null,0,null,null,null,null,"2013-04-22",22,84.615384615384613,"A",null,138,"Paraguay","PRY",2010,7.2,2010,32.4,472.91687999999999,2128.1259599999998]
[139,null,"Peru","UMIC",29399.816999999999,151403.02472366791,5150,"http://www.mef.gob.pe","Peru Ministry of Economy and Finance",2,"http://www.mef.gob.pe/index.php?option=com_content&view=article&id=363&Itemid=101125&lang=es",2,"http://www.mef.gob.pe/index.php?option=com_content&view=article&id=2028&Itemid=101421&lang=es",3,"http://ofi.mef.gob.pe/transparencia/Navegador/default.aspx",1,"http://ofi.mef.gob.pe/transparencia/Navegador/default.aspx",1,1,"http://www.mef.gob.pe/index.php?option=com_content&view=article&id=2620%3Aproyecto-de-presupuesto-ano-2011-nacional-regional-y-local-&catid=182%3Aprogramacion-formulacion-y-aprobacion&Itemid=101156&lang=es",2,1,2,"http://www.peru.gob.pe/transparencia/pep_transparencia.asp",1,"http://dnpp.mef.gob.pe/cnsClasif/faces/Main.jsp",1,1,2000,1,0,3,2011,1,0,2005,1,2,1,1999,1,1,2004,1,1,1,0,0,1,1,1,0,0,1,"http://www.mef.gob.pe/index.php?option=com_content&view=article&id=952&Itemid=101161&lang=es",1,"http://www.datosperu.org",2,"http://www.mef.gob.pe/index.php?option=com_content&view=article&id=2030&Itemid=101424&lang=es",1,"http://www.mef.gob.pe/index.php?option=com_content&view=article&id=1442&Itemid=100331&lang=es",1,"http://www.inei.gob.pe","Peru National Institute of Statistics and Informatics","http://www.bcrp.gob.pe","Central Reserve Bank of Peru","-",1,"http://www.mef.gob.pe/index.php?option=com_wrapper&view=wrapper&Itemid=101731",1,"http://www.mef.gob.pe/index.php?option=com_content&view=article&id=563&Itemid=100559&lang=es",0,"National laws and regulations similar to GFS",1,3,"Facebook","spa","eng","-","-",0,"SIAF II","Sistema Integrado de Administración Financiera","C","F",1,2001,"C+L",1,1,"LDSW > Oracle","Web","Apr 2009","Public","B","A","A","B","B+","D","C+","A","B+","C",3.05,3.1451612903225805,57,65,1,1,82,0.52300000000000002,0.51629999999999998,0.25850000000000001,0.79420000000000002,"LCR",null,null,"APEC",null,"Peru",3,null,1,null,2,0,null,null,null,null,null,24,92.307692307692307,"A",null,139,"Peru","PER",2010,4.9000000000000004,2011,27.8,1440.5910330000002,8173.1491260000003]
[140,null,"Philippines","LMIC",94852.03,209715.82780129884,2210,"http://www.dof.gov.ph","Philippines Department of Finance",2,"http://www.dbm.gov.ph/",2,"http://www.dof.gov.ph/gifmis",1,"-",1,"http://budgetngbayan.com/2013-national-expenditure-program-1643",0,1,"http://www.dbm.gov.ph/wp-content/uploads/BESF/BESF2013/B1.pdf",1,1,1,"http://www.dbm.gov.ph/?p=5125",0,"-",1,1,2008,1,1,3,2006,0,null,"-",1,3,0,2011,1,0,2010,1,1,1,0,0,1,1,1,1,1,1,"http://www.procurementservice.org/psdbm/index.php",0,"-",0,"-",0,"-",2,"http://www.census.gov.ph","Philippines National Statistics Office","http://www.bsp.gov.ph","Bangko Sentral ng Pilipinas","http://www.treasury.gov.ph/statdata/statdata.html",0,"-",1,"http://www.dof.gov.ph/?page_id=180",0,"National laws and regulations",0,2,"Twitter, Facebook, Youtube","spa","eng","-","-",1,"GIFMIS","Government Integrated Financial Management Information System","D","F",3,2015,"C+L",1,1,"LDSW > GIFMIS","Web","May 2010","Public","D","B","C","D+","D","D","D","D+","D+","D",1.45,2,48,55,1,1,88,0.51300000000000001,0.49669999999999997,0.2082,0.83409999999999995,"EAP",null,null,"APEC",null,"Philippines",5,2,1,1,1,0,null,null,null,null,null,16,61.53846153846154,"B",null,140,"Philippines","PHL",2009,18.399999999999999,2009,26.5,17452.773519999999,25135.787949999998]
[141,null,"Poland","HIC",38216,477008.73507372162,12480,"http://www.mf.gov.pl","Ministry of Finance of Poland",2,"http://www.mf.gov.pl/ministerstwo-finansow/dzialalnosc/finanse-publiczne",2,"http://www.mf.gov.pl/ministerstwo-finansow/dzialalnosc/finanse-publiczne/budzet-panstwa/trezor",1,"-",0,"-",0,0,"-",1,1,2,"http://centrumcyfrowe.pl/projekty/otwarty-budzet-konkurs-opowiedz-nam-o-budzecie/",1,"http://www.mf.gov.pl/index.php?const=1&dzial=73&wysw=2&sub=sub11",1,1,2001,0,null,"-","-",0,null,"-",1,2,1,2000,1,1,1995,1,1,1,0,0,1,1,1,0,0,0,"-",1,"http://sejmometr.pl",0,"-",0,"-",1,"http://www.stat.gov.pl","Poland Central Statistical Office","http://www.nbp.pl","National Bank of Poland ","-",0,"-",1,"http://www.finanse.mf.gov.pl/strona-glowna",2,"GFS 2001",0,2,"Youtube","pol","eng","-","-",0,"TREZOR","Informatyczny System Obsługi Budżetu Państwa / Information System of the State Budget","C","F",1,2012,"C+L",1,2,"Oracle","Web","-","-","-","-","-","-","-","-","-","-","-","-","-","-",59,64,null,1,47,0.64410000000000001,0.53590000000000004,0.49209999999999998,0.90439999999999998,"ECA","EU","OECD",null,null,"Poland",3,null,3,null,null,0,null,null,null,null,"2013-04-26",16,61.53846153846154,"B",null,141,"Poland","POL",2010,"<2",2008,10.6,27,4050.8959999999997]
[142,null,"Portugal","HIC",10637,225607.48633227198,21210,"http://www.portugal.gov.pt/pt/os-ministerios/ministerio-das-financas.aspx","Portugal Ministry of Finance and Public Administration",1,"http://www.dgo.pt/execucaoorcamental/Paginas/Sintese-da-Execucao-Orcamental-Mensal.aspx?Ano=2012&Mes=Maio",2,"http://www.rcc.gov.pt/Directorio/Temas/MA/Paginas/SIGOFA---Sistema-de-Gest%C3%A3o-Or%C3%A7amental,-Financeira-e-Administrativa.aspx",2,"https://sigo.min-financas.pt/sigoRoot/sigo/default.jsp",0,"-",0,0,"-",2,1,2,"http://www.portaldocidadao.pt/PORTAL/pt",1,"http://www.dgo.pt/apoioaosservicos/Paginas/Documentacao.aspx?CategoriaDocumentos=Classificadores",1,1,1997,1,1,4,2012,0,null,"-",1,2,1,1997,0,null,"-",1,1,1,0,0,1,1,1,1,0,1,"http://www.peppol.eu/",1,"http://www.dados.gov.pt/pt/inicio/inicio.aspx",2,"https://appls.portalautarquico.pt/DGALAplicacoes/",1,"http://www.portugal.gov.pt/pt/os-temas/reforma-administracao-local/reforma-administracao-local.aspx",2,"http://www.ine.pt","National Institute of Statistics","http://www.bportugal.pt","Bank of Portugal ","http://www.dgo.pt/execucaoorcamental/Paginas/Sintese-da-Execucao-Orcamental-Mensal.aspx",1,"http://www.dgo.pt/legislacao/Paginas/default.aspx",1,"http://www.dgo.pt/legislacao/Paginas/default.aspx",2,"EU regulations and national laws",0,3,"Twitter, Facebook, Youtube","por","eng","-","-",0,"SIGOFA","Sistema de Gestão Orçamental, Financeira e Administrativa / Budget, Financial and Administrative Management System","C","F",1,2003,"C+L",1,2,"Oracle","Web","-","-","-","-","-","-","-","-","-","-","-","-","-","-",62,58,null,1,33,0.71650000000000003,0.65359999999999996,0.6028,0.8931,null,"EU","OECD",null,null,"Portugal",5,1,1,1,2,0,null,null,null,null,null,17,65.384615384615387,"B",null,142,"Portugal","PRT"]
[143,null,"Qatar","HIC",1870.0409999999999,150426.90615520257,80440,"http://www.mof.gov.qa","Qatar Ministry of Economy and Finance",0,"-",2,"http://portal.www.gov.qa/wps/portal/about-hukoomi/integrated-e-government",0,"-",0,"-",0,0,"-",0,0,0,"-",0,"-",0,null,"-",0,null,"-","-",0,null,"-",0,null,null,"-",0,null,"-",0,0,0,0,0,0,0,0,0,0,0,"-",0,"-",0,"-",0,"-",0,"http://www.qsa.gov.qa","Qatar Statistics Authority (QSA)","http://www.qcb.gov.qa ","Qatar Central Bank","-",0,"-",0,"-",0,"-",0,0,"-","ara","eng","-","-",0,"RAS","Regulatory Accounting System","C","T",1,2010,"C",1,1,"LDSW","CS","-","-","-","-","-","-","-","-","-","-","-","-","-","-",0,"-",null,0,48,0.64049999999999996,0.73860000000000003,0.45129999999999998,0.73160000000000003,"MNA",null,null,null,null,"Qatar",0,null,null,null,null,0,null,null,null,null,null,2,7.6923076923076925,"D",null,143,"Qatar","QAT"]
[144,null,"Romania","UMIC",21390,169191.61953037689,7910,"http://www.mfinante.ro","Romania Ministry of Public Finance",1,"http://www.mfinante.ro/execbug.html?pagina=domenii",1,"http://discutii.mfinante.ro/static/10/Mfp/sistemedeplati/RoSTEPS_Presentation.pdf",1,"-",0,"-",0,0,"-",1,1,0,"-",1,"http://discutii.mfinante.ro/static/10/Mfp/buget2012/Ministerul_Finantelor_Publice.pdf",1,1,2001,1,0,3,2011,1,1,2006,1,2,1,2006,1,1,2004,1,1,1,0,0,1,1,0,1,0,0,"-",0,"-",0,"-",0,"-",1,"http://www.insse.ro","Romania National Institute of Statistics","http://www.bnro.ro","National Bank of Romania","-",0,"-",1,"http://www.mfinante.ro/rol.html?pagina=acasa",2,"-",0,2,"-","rom","-","-","-","-","BUDGET/TREZOR","Budget Preparation and Treasury Systems","C","F",1,2003,"C+L",1,1,"LDSW > Oracle","Web","-","-","-","-","-","-","-","-","-","-","-","-","-","-",47,59,1,1,62,0.60599999999999998,0.51629999999999998,0.42320000000000002,0.87829999999999997,"ECA","EU",null,null,null,"Romania",0,null,null,null,null,0,null,null,null,null,null,15,57.692307692307686,"B",null,144,"Romania","ROU",2010,"<2",2006,13.8,86,2951.82]
[145,null,"Russian Federation","UMIC",141930,1522273.551577142,10730,"http://www.minfin.ru","Ministry of Finance of the Russian Federation",2,"http://www.budget.gov.ru/",2,"http://www1.minfin.ru/ru/ebudget",3,"http://datamarts.roskazna.ru/index.php/infografika",1,"http://www.budget.gov.ru/data/opendata",0,1,"http://www.roskazna.ru/ob-ispolnenii-byudzhetov/ ",2,1,0,"-",1,"http://www1.minfin.ru/ru/budget/classandaccounting/",1,1,1997,1,1,3,2008,0,null,"-",1,2,1,1997,1,1,2007,1,1,1,0,0,1,1,1,1,1,1,"http://www.budget.gov.ru",1,"http://opengovdata.ru",0,"-",1,"http://www1.minfin.ru/ru/reforms/local_government/",2,"http://www.gks.ru","Russian State Committee for Statistics","http://www.cbr.ru","Central Bank of Russia","http://www.roskazna.ru/reports/eb.html",1,"http://www.garant.ru/products/ipo/prime/doc/12076379/ ",1,"http://www1.minfin.ru/ru/legislation/",2,"-",1,3,"-","rus","eng","-","-",0,"FTAS / eBudget","Federal Treasury Automation System","C","T",1,2011,"C+L",1,2,"Oracle (customized)","Web","Jan 2007","Draft","X","X","X","X","X","X","X","X","X","X",2.3888888888888888,2.4821428571428572,74,60,null,2,27,0.73450000000000004,0.66010000000000002,0.6583,0.88500000000000001,"ECA",null,null,"APEC",null,"Russian Federation",3,1,1,null,1,0,null,null,null,null,"2013-05-08",21,80.769230769230774,"A",null,145,"Russian Federation","RUS",2009,"<2",2006,11.1,28,15754.23,null,null,"DAD"]
[146,null,"Rwanda","LIC",10942.95,6212.2967971552953,570,"http://www.minecofin.gov.rw","Rwanda Ministry of Finance and Economic Planning",1,"http://www.minecofin.gov.rw/node/511",1,"http://www.minecofin.gov.rw/webfm_send/2098",1,"-",0,"-",0,0,"-",1,1,0,"-",0,"-",1,0,2011,1,0,3,2011,0,null,"-",0,null,null,"-",0,null,"-",1,1,0,1,0,1,1,0,1,0,0,"-",0,"-",0,"-",0,"-",0,"http://www.statistics.gov.rw","Rwanda National Institute of Statistics","http://www.bnr.rw","National Bank of Rwanda","-",0,"-",1,"http://www.minecofin.gov.rw/library/Laws%20and%20Regulations/Ministerial%20Instructions/Ministerial_instruction_on_IFMS_Rolllout.pdf",2,"-",0,1,"-","eng","-","-","-","-","SmartFMS","Integrated Financial Management Information System","C","F",3,2013,"C",1,1,"LDSW > Oracle","Web","Nov 2010","Public","A","A","A","C+","B+","D","D+","D+","B+","D+",2.7,2.9193548387096775,8,11,null,2,140,0.3291,0.33989999999999998,6.1400000000000003E-2,0.58609999999999995,"AFR",null,null,null,null,"Rwanda",0,null,null,null,null,0,null,null,null,null,null,7,26.923076923076923,"C",null,146,"Rwanda","RWA",2011,63.2,2011,44.9,6915.9444000000003,4913.3845499999998,null,null,"DAD"]
[147,null,"St. Kitts and Nevis","HIC",53.051000000000002,668.8971143274282,12610,"http://www.gov.kn/ct.asp?xItem=1808&ctNode=62&mp=1","Ministry of Finance and Sustainable Development",0,"-",1,"http://www.cartac.org/UserFiles/File/FMIS%20Workshop%20Sept%202009%20-%20Belize/INTEGRATION%20OF%20SYSTEM%20REFORM%20WITH%20BROADER%20PFM%20REFORM_antigua_StKitts_sessionfive.pdf",0,"-",0,"-",0,0,"-",0,0,0,"-",0,"-",0,null,"-",0,null,"-","-",0,null,"-",0,null,null,"-",0,null,"-",0,0,0,0,0,0,0,0,0,0,0,"-",0,"-",0,"-",0,"-",0,"-","Min of Finance and Sustainable Dev, Statistics Dept","http://www.eccb-centralbank.org","East Caribbean Central Bank","-",0,"-",0,"-",0,"-",0,2,"-","eng","-","-","-","-","FMIS","Financial Management Information System","C","F",1,2008,"C",1,2,"FITRIX","Web","Dec 2009","Final","X","X","X","X","X","X","X","X","X","X",2.15,2.25,"-","-",null,0,81,0.5272,0.183,0.56479999999999997,0.83379999999999999,"LCR",null,null,null,null,"St. Kitts and Nevis",0,null,null,null,null,0,null,null,null,null,null,1,3.8461538461538463,"D",null,147,"St. Kitts and Nevis","KNA"]
[148,null,"St. Lucia","UMIC",176,1200.6733908070132,6820,"http://www.finance.gov.lc/","Min of Finance and Econ Affairs",1,"http://www.finance.gov.lc/resources/index/25 ",1,"http://www.cartac.org/UserFiles/File/FMIS%20Workshop%20Sept%202009%20-%20Belize/SS%20PresentationStLuciasessionone.pdf",1,"-",0,"-",0,0,"-",1,1,0,"-",0,"-",1,1,1999,0,null,"-","-",0,null,"-",0,null,null,"-",0,null,"-",1,1,0,0,0,1,1,0,0,0,0,"-",0,"-",0,"-",0,"-",0,"http://www.stats.gov.lc","St Lucia Gov Statistics Dept","http://www.eccb-centralbank.org","East Caribbean Central Bank","-",0,"-",0,"-",0,"-",0,2,"Facebook, Twitter, Linkedin","eng","-","-","-","-","FMIS","Financial Management Information System","C","F",3,2012,"C+L",2,2,"SmartStream","Web","Feb 2010","Final","X","X","X","X","X","X","X","X","X","X",1.8,2.225806451612903,"-","-",null,2,90,0.51219999999999999,0.34639999999999999,0.38140000000000002,0.80889999999999995,"LCR",null,null,null,null,"St. Lucia",0,null,null,null,null,0,null,null,null,null,null,7,26.923076923076923,"C",null,148,"St. Lucia","LCA",1995,20.9,null,null,36.783999999999999]
[149,null,"St. Vincent and the Grenadines","UMIC",109.36499999999999,663.85059934836397,6070,"http://www.finance.gov.vc","Min of Finance and Econ Planning",1,"http://www.finance.gov.vc/index.php?option=com_content&view=section&layout=blog&id=21&Itemid=103",1,"http://www.caricad.net/UserFiles/File/casestudysvg.pdf",1,"-",0,"-",0,0,"-",0,0,0,"-",0,"-",1,1,2005,0,null,"-","-",0,null,"-",0,null,null,"-",0,null,"-",0,0,0,0,0,0,0,0,0,0,0,"-",0,"-",0,"-",0,"-",0,"http://stats.gov.vc","Min of Finance and Econ Planning, Statistics Office","http://www.eccb-centralbank.org","East Caribbean Central Bank","-",0,"-",0,"-",0,"-",0,0,"-","eng","-","-","-","-","FMIS","Financial Management Information System","C","F",3,2012,"C+L",2,2,"SmartStream","Web","Sep 2006","Final","X","X","X","X","X","X","X","X","X","X",2.3125,2.6666666666666665,"-","-",null,0,85,0.51770000000000005,0.31369999999999998,0.46970000000000001,0.76959999999999995,"LCR",null,null,null,null,"St. Vincent and the Grenadines",0,null,null,null,null,0,null,null,null,null,null,5,19.230769230769234,"D",null,149,"St. Vincent and the Grenadines","VCT"]
[150,null,"Samoa","LMIC",183.874,580.49952469131551,3160,"http://www.mof.gov.ws","Samoa Ministry of Finance",1,"http://www.mof.gov.ws/Services/tabid/5757/language/en-US/Default.aspx",1,"http://ec.europa.eu/europeaid/what/economic-support/public-finance/documents/samoa_pfm_en.pdf",1,"-",0,"-",0,0,"-",1,1,0,"-",0,"-",1,1,2008,1,0,3,2010,0,null,"-",0,null,null,"-",0,null,"-",1,1,0,0,0,1,1,0,0,1,1,"http://www.mof.gov.ws/Services/Procurement/tabid/5587/language/en-US/Default.aspx",0,"-",0,"-",0,"-",0,"http://www.spc.int/prism/country/ws/stats","Samoa Statistical Services Division","http://www.cbs.gov.ws","Central Bank of Samoa","-",0,"-",1,"http://www.mof.gov.ws/AboutUs/WhatweDo/tabid/5649/language/en-US/Default.aspx",2,"GFS 2001",0,2,"-","eng","-","-","-","-","FMIS","Financial Management Information System","C","F",1,2006,"C+L",1,2,"FinanceOne","Web","Apr 2010","Public","B","B","C","D+","C","D","C+","D+","D+","C",2,2.0892857142857144,"-","-",null,0,114,0.43580000000000002,0.28100000000000003,0.19270000000000001,0.83350000000000002,"EAP",null,null,null,null,"Samoa",0,null,null,null,null,0,null,null,null,null,null,8,30.76923076923077,"C",null,150,"Samoa","WSM"]
[151,null,"San Marino","HIC",31.734999999999999,1900,59870.805104773906,"http://www.finanze.sm","Ministry of Finance and Budget",1,"http://www.finanze.sm/on-line/Home/docCatArchivionormeecircolari.24000787.1.15.1.html",0,"-",1,"-",0,"-",0,0,"-",1,1,0,"-",0,"-",1,0,2011,1,0,3,2011,0,null,"-",0,null,null,"-",0,null,"-",1,1,0,0,0,1,0,0,1,0,1,"http://www.statistica.sm/on-line/Home/Pubblicazioni/docCatRelazioneeconomicostatisticaalbilanciodiprevisionedellostato.14000523.1.10.1.html",0,"-",0,"-",0,"-",1,"http://www.statistica.sm","San Marino Office of Economic Planning - Data Processing and Statistics","http://www.bcsm.sm ","Central Bank of the Republic of San Marino","-",0,"-",0,"-",2,"-",0,2,"-","ita","eng","-","-",0,"-","-","C","-","-","-","-","-","-","-","-","-","-","-","-","-","-","-","-","-","-","-","-","-","-","-","-",null,"-",52,0.63049999999999995,0.29409999999999997,0.6794,0.91790000000000005,null,"EUR",null,null,null,"San Marino",0,null,null,null,null,0,null,null,null,null,"2013-04-04",6,23.076923076923077,"D",null,151,"San Marino","SMR"]
[152,null,"São Tomé and Principe","LMIC",168.52600000000001,226.94274013936612,1350,"http://www.gov.st","Ministry of Planning and Finance / no website",0,"-",0,"-",0,"-",0,"-",0,0,"-",0,0,0,"-",0,"-",0,null,"-",0,null,"-","-",0,null,"-",0,null,null,"-",0,null,"-",0,0,0,0,0,0,0,0,0,0,0,"-",0,"-",0,"-",0,"-",1,"http://www.ine.st","Sao Tomé and Principe National Institute of Statistics","http://www.bcstp.st","Banco Central de S. Tomé e Príncipe","-",0,"-",0,"-",0,"-",0,1,"-","por","fre","eng","-",0,"-","-","C","-","-","-","-","-","-","-","-","Jan 2010","Public","B","C","C","D+","D","D","D+","D","D+","D",1.55,1.7666666666666666,29,0,null,0,138,0.3327,0.1176,0.13739999999999999,0.74319999999999997,"AFR",null,null,null,null,"São Tomé and Principe",0,null,null,null,null,0,null,null,null,null,null,0,0,"D",null,152,"São Tomé and Principe","STP",2001,28.2,2009,66.2,47.524332000000001,111.56421200000001]
[153,null,"Saudi Arabia","HIC",28082.541000000001,500542.9701508616,17820,"http://www.mof.gov.sa","Saudi Arabia Ministry of Finance",1,"http://www.mof.gov.sa/Arabic/DownloadsCenter/Pages/Budget.aspx",1,"http://www.mof.gov.sa/English/Pages/EgovernmentInitiative.aspx",1,"-",1,"http://www.mof.gov.sa/Arabic/DownloadsCenter/Pages/Budget.aspx",0,0,"-",1,0,0,"-",0,"-",1,1,2003,0,null,"-","-",0,null,"-",0,null,null,"-",0,null,"-",0,0,0,0,0,0,0,0,0,0,0,"-",1,"http://www.saudi.gov.sa/wps/portal/!ut/p/c4/04_SB8K8xLLM9MSSzPy8xBz9CP0os3iTMGenYE8TIwODUEsLA89QU69g11A_YwMTQ_3g1Dz9gmxHRQCO1nwy",0,"-",0,"-",0,"http://www.cdsi.gov.sa","Saudi Arabia  Central Department of Statistics and Information","http://www.sama-ksa.org","Saudi Arabian Monetary Agency","-",0,"-",1,"http://www.mof.gov.sa/Arabic/Roles/Pages/default.aspx",0,"-",0,1,"-","ara","eng","-","-",0,"GFMIS","Government Financial Management Information System","D","F",1,2008,"C+L",1,2,"Oracle","Web","-","-","-","-","-","-","-","-","-","-","-","-","-","-",1,1,null,0,41,0.66579999999999995,0.7974,0.43230000000000002,0.76770000000000005,"MNA",null,null,null,null,"Saudi Arabia",0,null,null,null,null,0,null,null,null,null,null,7,26.923076923076923,"C",null,153,"Saudi Arabia","SAU"]
[154,null,"Senegal","LMIC",12767.556,13714.078304488097,1070,"http://www.finances.gouv.sn","Senegal Ministry of the Economy and Finances",1,"http://www.finances.gouv.sn/les-nouveautes-du-site-du-ministere,4.html",2,"http://www.tresor.gouv.sn/index.php?option=com_content&view=article&id=198&Itemid=202",1,"-",0,"-",0,0,"-",1,1,0,"-",0,"-",1,1,2001,0,null,"-","-",0,null,"-",1,4,0,2006,1,0,2006,1,1,0,0,0,1,0,0,1,0,1,"http://www.marchespublics.sn/pmb/",0,"-",0,"-",0,"-",2,"http://www.ansd.sn","Senegal National Agency of Statistics and Demography","http://www.bceao.int ","Central Bank of West African States (BCEAO)","http://www.tresor.gouv.sn/",0,"-",1,"http://www.tresor.gouv.sn/index.php?option=com_content&view=article&id=116&Itemid=173",0,"-",0,3,"-","fre","eng","-","-",0,"ASTER / SIGFIP","Application des Services du Trésor en Réseau / Système Intégré de Gestion des Finances Publiques","C","T",1,2005,"C",1,1,"LDSW > Oracle","CS","Jun 2011","Public","C","B","C","B","C","D","B+","D+","D+","C",2.15,2.1774193548387095,10,3,null,1,163,0.26729999999999998,0.34639999999999999,0.1283,0.3271,"AFR",null,null,null,null,"Senegal",0,null,null,null,null,0,null,null,null,null,null,10,38.461538461538467,"C",null,154,"Senegal","SEN",2011,29.6,2011,46.7,3779.1965760000003,5962.4486520000009,null,2009]
[155,null,"Serbia","UMIC",7261,41287.209639311579,5690,"http://mfp.gov.rs","Serbia Ministry of Finance",2,"http://mfp.gov.rs/pages/issue.php?id=1568",2,"http://www.trezor.gov.rs/fmis-cir.html",1,"-",0,"-",0,0,"-",2,1,0,"-",0,"-",1,1,2008,1,1,3,2008,0,null,"-",1,2,1,2008,1,1,2008,1,1,1,0,0,1,1,1,1,1,0,"-",0,"-",0,"-",0,"-",0,"http://webrzs.stat.gov.rs/WebSite","Statistical Office of the Republic of Serbia","http://www.nbs.yu","National Bank of Serbia","-",1,"http://www.rjp.gov.rs/engleski/informator.html",1,"http://mfp.gov.rs/pages/issue.php?id=1578",1,"-",0,3,"-","srp","lat","eng","-",0,"FMIS + BPMIS","Financial Management Information System / Budget Preparation and Monitoring Information System","C","T",1,2008,"C+L",1,2,"SAP + LDSW","Web","Nov 2010","Public","B","B","A","C","A","A","A","A","C","D",3.1,2.7903225806451615,39,54,1,1,51,0.63119999999999998,0.57520000000000004,0.47010000000000002,0.84840000000000004,"ECA",null,null,null,null,"Serbia",0,null,null,null,null,0,null,null,null,null,null,16,61.53846153846154,"B",null,155,"Serbia","SRB",2010,"<2",2010,9.1999999999999993,15,668.01199999999994]
[156,null,"Seychelles","UMIC",86,956.89013247091282,11130,"http://www.statehouse.gov.sc","Ministry of Finance",0,"-",0,"-",0,"-",0,"-",0,0,"-",0,0,0,"-",0,"-",0,null,"-",0,null,"-","-",0,null,"-",0,null,null,"-",0,null,"-",0,0,0,0,0,0,0,0,0,0,0,"-",0,"-",0,"-",0,"-",2,"http://www.nsb.gov.sc","Seychelles National Statistics Bureau","http://www.cbs.sc","Central Bank of Seychelles","http://www.cbs.sc/govtbudgetdata.html",0,"-",0,"-",0,"-",0,0,"-","eng","-","-","-","-","-","-","C","-","-","-","-","-","-","-","-","Jun 2011","Public","C","A","B","C","D+","B","C+","C+","B","D",2.4500000000000002,2.5333333333333332,"-","-",null,0,84,0.51919999999999999,0.33329999999999999,0.4037,0.82040000000000002,"AFR",null,null,null,null,"Seychelles",0,null,null,null,null,0,null,null,null,null,null,0,0,"D",null,156,"Seychelles","SYC",2007,"<2"]
[157,null,"Sierra Leone","LIC",5997.4859999999999,2069.1021291361999,340,"http://www.mofed.gov.sl","Sierra Leone Ministry of Finance",1,"http://www.mofed.gov.sl/index.php?option=com_content&task=view&id=84&Itemid=119",2,"http://www.mofed.gov.sl/index.php?option=com_content&task=view&id=130&Itemid=2",1,"-",0,"-",0,0,"-",1,0,0,"-",0,"-",1,0,2009,1,0,5,2009,0,null,"-",1,4,0,2009,0,null,"-",1,1,0,0,0,1,0,0,1,0,0,"-",0,"-",0,"-",1,"http://www.mofed.gov.sl/index.php?option=com_content&task=view&id=93&Itemid=129",0,"http://www.statistics.sl","Sierra Leone Statistics Online","http://www.bankofsierraleone-centralbank.org","Bank of Sierra Leone","-",0,"-",1,"http://www.mofed.gov.sl/index.php?option=com_content&task=view&id=91&Itemid=127",0,"-",0,3,"-","eng","-","-","-","-","IFMIS","Integrated Financial Management Information System","C","F",2,2009,"C",1,2,"FreeBalance","Web","Dec 2010","Public","C","A","B","C","B","A","B+","C+","C","D+",2.75,2.35,39,"-",null,1,186,0.15570000000000001,0.1699,3.95E-2,0.2576,"AFR",null,null,null,"F","Sierra Leone",0,null,null,null,null,0,null,null,null,null,null,8,30.76923076923077,"C",null,157,"Sierra Leone","SLE",2003,53.4,2003,66.400000000000006,3202.6575240000002,3982.3307040000004,null,null,"DAD"]
[158,null,"Singapore","HIC",5183.7,222550.09546754885,42930,"http://www.mof.gov.sg","Singapore Ministry of Finance",2,"http://app.mof.gov.sg/singapore_budget_archives.aspx",2,"http://www.vital.gov.sg",2,"http://www.singaporebudget.gov.sg/budget_2013/revenue_expenditure/index.html#rev_est",0,"-",0,0,"-",2,1,2,"http://app.mof.gov.sg/data/cmsresource/eflyers/Rising%20Cost%20Flyer%202011.pdf",1,"http://www.singaporebudget.gov.sg/budget_2013/revenue_expenditure/toc.html",1,1,1996,1,1,5,2000,1,1,1996,1,4,1,1996,1,1,2006,1,1,"n/a",0,1,1,"n/a","n/a",1,1,1,"http://www.gebiz.gov.sg/",1,"http://data.gov.sg","n/a","-","n/a","-",3,"http://www.singstat.gov.sg","Singapore Department of Statistics","http://www.mas.gov.sg ","Monetary Authority of Singapore","http://www.data.gov.sg/common/search.aspx?a=MOF&ag=2",1,"http://www.data.gov.sg/common/search.aspx?a=MOF&ag=2",1,"http://app.mof.gov.sg/mission_vision_values.aspx",2,"http://www.singstat.gov.sg/publications/publications_and_papers/reference/mdscontent.html#public_finance",0,3,"-","eng","-","-","-","-","FMIS","Financial Management Information System","D","F",1,2012,"C+L",1,2,"SAP","Web","-","-","-","-","-","-","-","-","-","-","-","-","-","-","-","-",null,3,10,0.84740000000000004,1,0.69230000000000003,0.85,"EAP",null,null,"APEC",null,"Singapore",2,1,null,1,null,0,null,null,null,null,"2013-05-15",22,84.615384615384613,"A",null,158,"Singapore","SGP"]
[159,null,"Slovak Republic","HIC",5440,87410.900231968088,16070,"http://www.finance.gov.sk","Ministrstvo Financií - Ministry of Finance, Slovakia",2,"http://www.finance.gov.sk/Default.aspx?CatID=60",2,"http://www.pokladnica.sk/sk/informacny-system-sp",1,"-",0,"-",0,0,"-",2,1,1,"http://www.rozpocet.sk/app/homepage",1,"http://www.finance.gov.sk/Default.aspx?CatID=6963",1,1,2005,1,1,3,2005,0,null,"-",1,4,1,2005,1,1,2005,1,1,1,0,1,1,1,1,1,1,1,"http://www.portal.gov.sk/Portal/sk/Default.aspx",1,"http://data.gov.sk/",1,"http://www.finance.gov.sk/Default.aspx?CatID=7582",1,"http://www.finance.gov.sk/Default.aspx?CatID=5435",2,"http://portal.statistics.sk","Statistical Office of the Slovak Republic","http://www.nbs.sk","National Bank of Slovakia","http://www.informatizacia.sk/",1,"http://www.finance.gov.sk/Default.aspx?CatID=6",1,"http://www.finance.gov.sk/Default.aspx?CatID=3514",2,"-",0,3,"-","slo","eng","-","-",0,"FMIS","Financial Management Information System","D","F",1,2007,"C+L",1,2,"SAP + Oracle","Web","-","-","-","-","-","-","-","-","-","-","-","-","-","-",67,57,1,2,53,0.62919999999999998,0.50329999999999997,0.51470000000000005,0.86960000000000004,"ECA","EU","OECD",null,null,"Slovak Republic",1,null,1,null,null,0,null,null,null,null,"2013-05-03",18,69.230769230769226,"B",null,159,"Slovak Republic","SVK",2009,"<2",null,null,3]
[160,null,"Slovenia","HIC",2052,48452.265009923365,23610,"http://www.mf.gov.si","Ministry of Finance of the Republic of Slovenia",2,"http://www.mf.gov.si/si/delovna_podrocja/proracun/izvrsevanje_proracuna/",1,"http://www.pempal.org/data/upload/files/2011/10/3a_volj-_budget-system-and-budget-preparation-procedures-in-slovenia_eng.pdf",1,"-",1,"http://www.mf.gov.si/si/delovna_podrocja/proracun/sprejeti_proracun/2013/sprejeti_proracun_za_leto_2013",1,1,"http://www.mf.gov.si/fileadmin/mf.gov.si/pageuploads/Prora%C4%8Dun/Izvrsevanje_proracuna/2011/PorociloRE_I-VI_2011.pdf",2,1,1,"http://www.mf.gov.si/si/delovna_podrocja/proracun/splosno_o_proracunu/dokumenti",1,"http://www.mf.gov.si/si/delovna_podrocja/proracun/splosno_o_proracunu/klasifikacije/",1,1,2004,1,1,2,2007,0,null,"-",1,2,1,2002,1,1,1995,1,1,1,0,0,1,1,1,1,1,1,"http://www.enarocanje.si/?podrocje=portal",0,"-",2,"http://www.mf.gov.si/si/delovna_podrocja/lokalne_skupnosti/priprava_proracunov_in_zakljucnih_racunov_obcinskih_proracunov/",1,"http://www.mf.gov.si/si/delovna_podrocja/lokalne_skupnosti/priprava_proracunov_in_zakljucnih_racunov_obcinskih_proracunov/",2,"http://www.stat.si","Statistical Office of the Republic of Slovenia","http://www.bsi.si","Bank of Slovenia","http://www.umar.gov.si",1,"http://www.mf.gov.si/si/o_ministrstvu/informacije_javnega_znacaja/",1,"http://www.mf.gov.si/si/zakonodaja_in_dokumenti/sprejeta_zakonodaja/",2,"-",0,3,"-","slv","eng","-","-",0,"SAPPrA+MFERAC","Financial Management Information System","D","F",1,1998,"C+L",1,2,"Oracle + LDSW","Web","-","-","-","-","-","-","-","-","-","-","-","-","-","-",74,70,null,2,25,0.74919999999999998,0.66669999999999996,0.65090000000000003,0.93,"ECA","EU","OECD",null,null,"Slovenia",1,null,1,null,null,0,null,null,null,null,"2013-04-15",20,76.923076923076934,"A",null,160,"Slovenia","SVN",2004,"<2"]
[161,null,"Solomon Islands","LMIC",552.26700000000005,615.23578431911096,1110,"http://www.mof.gov.sb","Ministry of Finance and Treasury",2,"http://www.mof.gov.sb/GovernmentFinances/Mediareleases.aspx",1,"http://ec.europa.eu/europeaid/what/economic-support/public-finance/documents/solomonislands_pefa_2008_en.pdf",1,"-",0,"-",0,0,"-",2,1,0,"-",0,"-",1,1,2010,1,1,5,2009,0,null,"-",1,4,1,2010,0,null,"-",1,1,0,1,1,1,1,0,1,1,0,"-",0,"-",0,"-",0,"-",0,"http://www.spc.int/prism/country/sb/stats","Solomon Islands National Statistics Office","http://www.cbsi.com.sb","Central Bank of Solomon ","-",0,"-",1,"http://www.mof.gov.sb/AboutUs/BudgetUnit.aspx",0,"-",0,2,"-","eng","-","-","-","-","FMIS","Financial Management Information System","C","F",1,2012,"C+L",1,2,"MS Dynamics AX","Web","Nov 2008","Public","C","B","C","C","C","D","C+","D+","C+","D+",2,1.8333333333333333,"-","-",null,1,168,0.24160000000000001,0.13070000000000001,1.9800000000000002E-2,0.57430000000000003,"EAP",null,null,null,"F","Solomon Islands",0,null,null,null,null,0,null,null,null,null,"2013-05-08",{"$f":"J163+L163+N163+P163+R163+S163+U163+V163+W163+Y163+AA163+AB163+AD163+AE163+AH163+AI163+AK163+AM163+AO163+AP163","v":13},50,"B",null,161,"Solomon Islands","SLB",null,null,2006,22.7,null,125.364609,null,null,"DAD"]
[162,null,"Somalia","LIC",9556.8729999999996,"-","-","http://en.wikipedia.org/wiki/Transitional_Federal_Government","Somali Ministry of Finance",0,"-",1,"http://www.afdb.org/fileadmin/uploads/afdb/Documents/Project-and-Operations/SOMALIA%20-%20Country%20Brief.pdf",0,"-",0,"-",0,0,"-",1,0,0,"-",0,"-",0,null,"-",0,null,"-","-",0,null,"-",0,null,null,"-",0,null,"-",0,0,0,0,0,0,0,0,0,0,0,"-",0,"-",0,"-",0,"-",0,"-","Min of Natl Planning, Directorate of Statistics","http://www.somalbanca.org","Central Bank of Somalia","-",0,"-",0,"-",0,"-",0,1,"-","eng","-","-","-","-","TS","Treasury System","C","T",3,2013,"C",1,1,"LDSW","CS",2013,"-","-","-","-","-","-","-","-","-","-","-","-","-","-","-",null,"-",190,6.4000000000000001E-2,0.183,8.9999999999999993E-3,0,"AFR",null,null,null,"F","Somalia",0,null,null,null,null,0,null,null,null,null,null,2,7.6923076923076925,"D",null,162,"Somalia","SOM",null,null,null,null,null,null,null,null,"DAD"]
[163,null,"South Africa","UMIC",50586.756999999998,352037.99859013048,6960,"http://www.treasury.gov.za","South Africa National Treasury",2,"http://www.treasury.gov.za/documents/default.aspx",1,"http://oag.treasury.gov.za/Event%20Documentation/20120808%20Departmental%20CFO%20Forum/20120808%20-%206.2%20-%20Bobby%20Maake%20-%20IFMS%20Presentation.pdf",1,"-",1,"http://www.treasury.gov.za/documents/mtbps/2012/tables.aspx",0,0,"-",2,1,1,"http://www.treasury.gov.za/documents/national%20budget/2012/default.aspx",1,"http://scoa.treasury.gov.za/Pages/SCOADocuments.aspx",1,1,2000,1,1,3,1998,0,null,"-",1,4,1,1998,1,1,2001,1,1,0,0,0,1,1,0,1,0,0,"-",0,"-",0,"-",1,"http://www.treasury.gov.za/documents/provincial%20budget/default.aspx",2,"http://www.statssa.gov.za","Statistics South Africa","http://www.resbank.co.za","South African Reserve Bank","http://www.gcis.gov.za/",0,"-",1,"http://www.treasury.gov.za/nt/Top%20Structure%20Organisation.pdf",2,"-",0,3,"-","eng","-","-","-","-","IFMS","Integrated Financial Management System","C","F",3,2013,"C+L",1,2,"Oracle","Web","Sep 2008","Public","A","A","A","B","B+","A","C+","A","B+","D",3.35,3.3225806451612905,90,92,1,3,101,0.4869,0.45750000000000002,0.22140000000000001,0.78169999999999995,"AFR",null,null,null,null,"South Africa",4,2,null,2,null,0,null,null,null,null,null,18,69.230769230769226,"B",null,163,"South Africa","ZAF",2009,13.8,2006,23,6980.9724659999993,11634.954109999999]
[164,null,"South Sudan","LMIC",10314.021000000001,19170,1858.6349591492976,"http://www.goss.org","Ministry of Finance & Economic Planning",1,"http://www.goss-online.org/magnoliaPublic/en/ministries/Finance/Annual-Budgets.html",1,"http://www.sudantribune.com/South-Sudan-launches-electronic,39069",1,"-",0,"-",0,0,"-",1,0,0,"-",0,"-",1,1,2006,0,null,"-","-",0,null,"-",0,null,null,"-",0,null,"-",1,1,1,0,0,1,1,0,1,0,0,"-",0,"-",0,"-",1,"http://www.goss-online.org/magnoliaPublic/en/Independant-Commissions-and-Chambers/Local-Government-Board-.html",0,"http://www.ssnbs.org","National Bureau of Statistics","-","Central Bank of South Sudan","-",0,"-",1,"http://www.goss-online.org/magnoliaPublic/en/ministries/Finance.html",0,"-",0,1,"-","eng","-","-","-","-","FMIS","Financial Management Information System","C","F",3,2013,"C",1,2,"FreeBalance","Web","Sep 2011","Draft","X","X","X","X","X","X","X","X","X","X",1.9,1.7413793103448276,"-","-",null,"-",175,0.22389999999999999,0.14380000000000001,7.2499999999999995E-2,0.45550000000000002,"AFR",null,null,null,"F","South Sudan",0,null,null,null,null,0,null,null,null,null,"2013-04-30",6,23.076923076923077,"D",null,164,"South Sudan","SSD",null,null,2009,50.6,null,5218.8946260000002,null,2010]
[165,null,"Spain","HIC",46235,1428303.3355976345,30890,"http://www.minhap.gob.es","Ministry of Finance and Public Administration",2,"http://www.minhap.gob.es/en-GB/Estadistica%20e%20Informes/Paginas/estadisticaseinformes.aspx",2,"http://www.oficinavirtual.pap.minhap.gob.es/sitios/OficinaVirtual/en-GB/CatalogoSistemasInformacion/Paginas/ListadoSIExternosUA.aspx?lenguaje=EN&perfil=5",2,"http://servicioswebbis.meh.es/apps/entidadeslocales/",1,"http://servicioswebbis.meh.es/apps/entidadeslocales/",1,1,"http://www.igae.pap.minhap.gob.es/sitios/igae/es-ES/InformesCuentas/Informes/Paginas/publicaciones.aspx",2,1,0,"-",1,"http://www.minhap.gob.es/Documentacion/Publico/NormativaDoctrina/Contabilidad%20Publica/ORDENES%20MINISTERIALES/ORDEN%20de%201%20de%20febrero%20de%201996%20documentos%20contables.pdf",1,1,1996,1,1,4,2000,1,1,2000,1,2,1,2002,1,1,2005,1,1,1,1,0,1,1,1,1,1,0,"-",1,"http://datos.gob.es",0,"-",1,"http://www.minhap.gob.es/Documentacion/Publico/NormativaDoctrina/Contabilidad%20Publica/ORDENES%20MINISTERIALES/Orden%20EHA-1037-2010.pdf",0,"http://www.ine.es","Spain National Institute of Statistics","http://www.bde.es","Bank of Spain","-",1,"http://www.minhap.gob.es/es-ES/Paginas/Accesibilidad.aspx",1,"http://www.minhap.gob.es/es-ES/El%20Ministerio/Organigrama/Paginas/default.aspx",1,"COFOG + National Stds",0,3,"-","spa","eng","cat","glg",0,"SICOP II","Sistema de Información Contable para la Administración del Estado / Information System for State Accounting","D","F",1,2002,"C+L",1,1,"LDSW > Oracle","Web","-","-","-","-","-","-","-","-","-","-","-","-","-","-",63,63,1,2,23,0.77700000000000002,0.75819999999999999,0.63180000000000003,0.94089999999999996,null,"EU","OECD",null,null,"Spain",9,3,1,3,2,13,3,5,4,1,"2013-04-22",23,88.461538461538453,"A",null,165,"Spain","ESP"]
[166,null,"Sri Lanka","LMIC",20869,53832.394518182315,2580,"http://www.treasury.gov.lk","Sri Lanka Ministry of Finance and Planning",1,"http://www.erd.gov.lk/publication.html",2,"http://www.erd.gov.lk/publicweb/SAD/SAD_index.html",1,"-",0,"-",0,0,"-",1,0,0,"-",1,"http://www.nbd.gov.lk/BOM/nbd/budgetestimates2012.htm",1,1,2007,1,0,4,2006,1,0,2008,1,4,1,2007,1,1,2007,1,1,1,0,0,1,1,1,1,0,0,"-",0,"-",1,"http://thirddimension.in/agaoa/resourcematerial/current/Experience%20of%20Sri%20Lanka%20in%20Computerization%20of%20Government%20Accounts.pdf",1,"http://www.sad.gov.lk/EPPRM/sad/cgas.htm",3,"http://www.statistics.gov.lk","Sri Lanka Department of Census and Statistics","http://www.cbsl.gov.lk ","Central Bank of Sri Lanka","http://203.94.72.18/sata/",0,"-",1,"http://www.nbd.gov.lk/docs/gazat-duties-function/Powers-duties-func.pdf",0,"-",0,3,"-","tam","sin","eng","-",0,"CIGAS","Computerised Integrated Government Accounting System","C","T",1,1995,"C",1,1,"LDSW","CS","-","-","-","-","-","-","-","-","-","-","-","-","-","-",46,67,null,2,115,0.43569999999999998,0.37909999999999999,0.19220000000000001,0.73570000000000002,"SAR",null,null,null,null,"Sri Lanka",1,null,1,null,null,0,null,null,null,null,null,14,53.846153846153847,"B",null,166,"Sri Lanka","LKA",2010,4.0999999999999996,2010,8.9,855.62899999999991,1857.3410000000001,null,null,"DAD"]
[167,null,"Sudan","LMIC",34318.385000000002,58276.34154436252,1310,"http://www.mof.gov.sd","Sudan Ministry of Finnace",1,"http://www.mof.gov.sd/moazna.php",0,"-",1,"-",0,"-",0,0,"-",1,0,0,"-",0,"-",1,0,2008,0,null,"-","-",0,null,"-",0,null,null,"-",0,null,"-",0,0,0,0,0,0,0,0,0,0,0,"-",0,"-",0,"-",0,"-",3,"http://cbs.gov.sd","Sudan Central Bureau of Statistics","http://www.bankofsudan.org","Bank of Sudan","http://www.bankofsudan.org/",0,"-",0,"-",0,"-",0,1,"-","ara","eng","-","-",0,"-","-","C","-","-","-","-","-","-","-","-","May 2009","Draft","X","X","X","X","X","X","X","X","X","X",1.8,1.7407407407407407,"-",8,null,0,165,0.26100000000000001,0.25490000000000002,7.2499999999999995E-2,0.45550000000000002,"AFR",null,null,null,"F","Sudan",0,null,null,null,null,0,null,null,null,null,null,4,15.384615384615385,"D",null,167,"Sudan","SDN",2009,19.8,2009,46.5,6795.0402300000005,15958.049025]
[168,null,"Suriname","UMIC",529.41899999999998,4351,8218.4432368313192,"http://www.gov.sr/sr/ministerie-van-financi%C3%ABn.aspx","Ministerie van Financiën - Suriname",1,"http://www.gov.sr/sr/ministerie-van-financi%C3%ABn/documenten.aspx",0,"-",1,"-",0,"-",0,0,"-",1,0,0,"-",0,"-",0,null,"-",0,null,"-","-",0,null,"-",0,null,null,"-",0,null,"-",0,0,0,0,0,0,0,0,0,0,0,"-",0,"-",0,"-",0,"-",0,"http://www.statistics-suriname.org","Suriname General Bureau of Statistics","http://www.cbvs.sr","Central Bank of Suriname","-",0,"-",1,"http://www.gov.sr/sr/ministerie-van-financi%C3%ABn/over-financi%C3%ABn.aspx",0,"-",0,3,"-","dut","eng","-","-",0,"IFMIS","Integrated Financial Management Information System","C","F",3,2015,"C+L",1,2,"FreeBalance","Web","Feb 2011","Draft","X","X","X","X","X","X","X","X","X","X",1.65,1.75,"-","-",null,0,116,0.43440000000000001,0.16339999999999999,0.35780000000000001,0.78210000000000002,"LCR",null,null,null,null,"Suriname",0,null,null,null,null,0,null,null,null,null,null,3,11.538461538461538,"D",null,168,"Suriname","SUR",1999,15.5,null,null,82.059944999999985]
[169,null,"Swaziland","LMIC",1067.7729999999999,3520.2826715770052,3300,"http://www.gov.sz","Swaziland Ministry of Finance",1,"http://www.gov.sz/index.php?option=com_content&view=article&id=702&Itemid=574",0,"-",1,"-",0,"-",0,0,"-",1,0,0,"-",0,"-",1,0,2011,1,0,3,2011,0,null,"-",1,4,1,2011,1,1,2011,1,1,0,0,0,1,1,0,1,0,0,"-",0,"-",0,"-",0,"-",0,"http://www.gov.sz","Swaziland Central Statistical Office","http://www.centralbank.org.sz","The Central Bank of Swaziland","-",0,"-",0,"-",0,"-",0,3,"-","eng","-","-","-","-","-","-","C","-","-","-","-","-","-","-","-","May 2010","Draft","X","X","X","X","X","X","X","X","X","X",2.2777777777777777,2.25,"-","-",null,2,144,0.31790000000000002,0.14380000000000001,0.1125,0.69730000000000003,"AFR",null,null,null,null,"Swaziland",0,null,null,null,null,0,null,null,null,null,null,9,34.615384615384613,"C",null,169,"Swaziland","SWZ",2010,40.6,2009,63,433.51583800000003,672.69698999999991]
[170,null,"Sweden","HIC",9453,502451.41675843683,53150,"http://www.sweden.gov.se","Finansdepartementet - Ministry of Finance, Sweden",2,"http://www.sweden.gov.se/sb/d/2106",2,"http://www.esv.se/Verktyg--stod/Hermes",2,"http://www.esv.se/Verktyg--stod/Hermes/",1,"http://www.esv.se/Verktyg--stod/Publikationer/2012/Tidsserier-statens-budget-mm-2011/",0,1,"http://www.esv.se/sv/Verktyg--stod/Publikationer/?q=*%2bhidden:meta:category:Publikationer&defcategory=Kategori:Publikationer&defso=2&uaid=",2,1,0,"-",0,"-",1,1,2001,1,1,3,2001,0,null,"-",1,4,1,2001,1,1,2001,1,1,1,1,0,1,1,1,1,1,1,"http://www.upphandlingsstod.se/, http://www.peppol.eu/",1,"http://www.opengov.se",0,"-",1,"http://www.esv.se/PageFiles/2720/accrual-accounting-in-swedish-central-government.pdf",3,"http://www.scb.se","Statistics Sweden","http://www.riksbank.com","Sveriges Riksbank ","http://www.esv.se/amnesomraden/Styrning/Budgetprocessen/",1,"http://www.sweden.gov.se/sb/d/2853/a/18096",1,"http://www.sweden.gov.se/sb/d/2062/a/20398, http://epp.eurostat.ec.europa.eu/portal/page/portal/government_finance_statistics/documents/SE-EDP_Inventory-20091001.pdf",0,"-",0,3,"-","swe","eng","-","-",0,"HERMES","Financial Management Information System","D","F",1,2006,"C+L",1,1,"LDSW","Web","-","-","-","-","-","-","-","-","-","-","-","-","-","-",84,83,1,3,7,0.8599,0.84309999999999996,0.82250000000000001,0.91410000000000002,null,"EU","OECD",null,null,"Sweden",2,2,null,null,null,0,null,null,null,null,null,19,73.076923076923066,"B",null,170,"Sweden","SWE"]
[171,null,"Switzerland","HIC",7907,604104.81019643019,76400,"http://www.efd.admin.ch","Swiss Federal Department of Finance",2,"http://www.efv.admin.ch/",2,"http://www.efd.admin.ch/org/org/00582/00806/index.html?lang=de",1,"-",1,"http://www.efv.admin.ch/d/dokumentation/finanzberichterstattung/bundeshaushalt_sdds.php",0,0,"-",2,1,0,"-",0,"-",1,1,2001,1,1,3,2004,0,null,"-",1,4,1,2003,1,1,2009,1,1,1,0,0,1,1,1,1,1,1,"http://www.procure.ch/",0,"-",0,"-",1,"http://www.fdk-cdf.ch/flyer_hrm2_d.pdf",0,"http://www.bfs.admin.ch","Swiss Federal Statistical Office","http://www.snb.ch","Swiss National Bank ","-",1,"http://www.admin.ch/ch/e/rs/152_31/a2.html",1,"http://www.efd.admin.ch/dokumentation/gesetzgebung/00570/index.html?lang=en",2,"System of National Accounts",0,3,"-","ger","fre","ita","eng",0,"FMIS","Financial Management Information System","D","F",1,2007,"C+L",1,2,"SAP","Web","-","-","-","-","-","-","-","-","-","-","-","-","-","-","-","-",null,1,15,0.81340000000000001,0.67320000000000002,0.87819999999999998,0.88880000000000003,null,"EUR","OECD",null,null,"Switzerland",1,null,1,null,null,3,null,1,2,null,null,17,65.384615384615387,"B",null,171,"Switzerland","CHE",null,null,null,null,null,null,null,null,"DAD"]
[172,null,"Syrian Arab Republic","LMIC",20820.311000000002,59150,2840.97581443428,"http://www.syrianfinance.org","Syria Ministry of Finance",0,"-",1,"http://ted.europa.eu/udl?uri=TED:NOTICE:220587-2007:TEXT:EN:HTML",0,"-",0,"-",0,0,"-",0,0,0,"-",0,"-",0,null,"-",0,null,"-","-",0,null,"-",0,null,null,"-",0,null,"-",0,0,0,0,0,0,0,0,0,0,0,"-",0,"-",0,"-",0,"-",2,"http://www.cbssyr.org","Syria Central Bureau of Statistics ","http://www.banquecentrale.gov.sy","Central Bank of Syria","http://www.egov.sy/egov/",0,"-",0,"-",0,"-",0,1,"-","ara","eng","-","-",0,"IFMIS","Integrated Financial Management Information System","C","F",1,2007,"C+L",1,1,"LDSW > MS SQL","Web","Mar 2006","Final","X","X","X","X","X","X","X","X","X","X",1.7222222222222223,2,"-","-",null,0,128,0.3705,0.2288,0.19520000000000001,0.68759999999999999,"MNA",null,null,null,null,"Syrian Arab Republic",0,null,null,null,null,0,null,null,null,null,null,1,3.8461538461538463,"D",null,172,"Syrian Arab Republic","SYR",2004,"<2"]
[173,null,"Chinese Taipei (Taiwan)","HIC",23268,470013.6,20200,"http://www.mof.gov.tw","Ministry of Finance ROC",2,"http://eng.dgbas.gov.tw/ct.asp?xItem=25458&ctNode=1969&mp=2",2,"http://eng.dgbas.gov.tw/lp.asp?ctNode=1969&CtUnit=1005&BaseDSD=7&mp=2",2,"http://web02.mof.gov.tw/njswww/WebProxy.aspx?sys=100&funid=defjspf2",0,"-",0,1,"http://web02.mof.gov.tw/njswww/WebProxy.aspx?sys=100&funid=defjspf2",1,1,0,"-",0,"-",0,null,"-",0,null,"-","-",0,null,"-",1,4,0,1989,0,null,"-",1,1,1,1,0,1,0,1,0,0,0,"-",0,"-",1,"http://eng.dgbas.gov.tw/lp.asp?CtNode=1913&CtUnit=979&BaseDSD=7&mp=2",1,"http://eng.dgbas.gov.tw/lp.asp?CtNode=2108&CtUnit=1039&BaseDSD=7&mp=2",3,"http://eng.stat.gov.tw","National Statistics (ROC)","http://www.cbc.gov.tw","Central Bank of the ROC","http://www.nta.gov.tw/en/03information/inf_b01_main.asp?bull_id=2619",0,"-",1,"http://www.mof.gov.tw/engweb/ct.asp?xItem=66089&CtNode=673&mp=2",0,"-",0,3,"-","chi","eng","-","-",0,"GBA","Government Budget Accounting Information Management System","C","F",1,2004,"C+L",1,1,"LDSW","Web","-","-","-","-","-","-","-","-","-","-","-","-","-","-","-","-",null,"-","-","-","-","-","-","EAP",null,null,"APEC",null,"Chinese Taipei (Taiwan)",3,null,null,2,1,0,null,null,null,null,null,10,38.461538461538467,"C",null,173,"Chinese Taipei (Taiwan)","TWN"]
[174,null,"Tajikistan","LIC",6976.9579999999996,6077.9703151980912,870,"http://www.minfin.tj","Ministry of Finance of the Republic of Tajikistan",1,"http://minfin.tj/index.php?do=static&page=budget",1,"http://minfin.tj/reform.html",1,"-",0,"-",0,0,"-",1,1,0,"-",0,"-",1,1,2008,1,1,3,2008,0,null,"-",1,3,1,2009,0,null,"-",1,1,1,0,0,1,1,0,0,0,0,"-",0,"-",0,"-",0,"-",0,"http://www.stat.tj","Tajikistan State Statistical Committee","http://www.nbt.tj","National Bank of Tajikistan","-",0,"-",1,"http://minfin.tj/index.php?do=static&page=osn",0,"-",0,1,"-","tgk","rus","eng","-",0,"FMIS","Financial Management Information System","C","F",3,2015,"C+L",1,0,"?","Web","Jun 2007","Public","D","A","D","D+","B","C","C+","D+","D+","D+",1.95,2.0666666666666669,17,"-",null,1,122,0.40689999999999998,0.24179999999999999,0.1474,0.83130000000000004,"ECA",null,null,null,null,"Tajikistan",0,null,null,null,null,0,null,null,null,null,"2013-04-23",11,42.307692307692307,"C",null,174,"Tajikistan","TJK",2009,6.6,2009,46.7,460.47922799999992,3258.2393859999997,null,null,"DAD"]
[175,null,"Tanzania","LIC",46218.485999999997,24242.667444370705,540,"http://www.mof.go.tz","Tanzania Ministry of Finance and Economic Affairs",1,"http://www.mof.go.tz/index.php?option=com_content&task=view&id=22&Itemid=36",1,"http://www.mof.go.tz/mofdocs/msemaji/PFMRP%20ANNUAL%20PROGRESS%20REPORT-WEBSITE.pdf",1,"-",0,"-",0,0,"-",2,1,1,"http://www.mof.go.tz/index.php?option=com_content&task=blogcategory&id=21&Itemid=206",1,"http://www.mof.go.tz/index.php?option=com_content&task=view&id=622&Itemid=205",1,1,2001,1,0,3,2009,0,null,"-",1,3,1,2001,1,1,2007,1,1,1,0,0,1,0,1,1,0,0,"-",0,"-",0,"-",1,"http://www.mof.go.tz/index.php?option=com_content&task=blogcategory&id=20&Itemid=205",0,"http://www.tanzania.go.tz/statistics.html","Tanzania National Bureau of Statistics ","http://www.bot-tz.org ","Bank of Tanzania","-",0,"-",1,"http://www.mof.go.tz/index.php?option=com_content&task=view&id=13&Itemid=27",0,"-",0,3,"-","swa","eng","-","-",0,"IFMS","Integrated Financial Management System","C","F",3,2012,"C+L",2,2,"Epicor","Web","Nov 2010","Public","C","A","B","C","NR","D","C+","B+","B","C+",2.6111111111111112,2.4423076923076925,47,45,1,2,139,0.33110000000000001,0.35289999999999999,8.3900000000000002E-2,0.55640000000000001,"AFR",null,null,null,null,"Tanzania",2,null,1,1,null,0,null,null,null,null,null,15,57.692307692307686,"B",null,175,"Tanzania","TZA",2007,67.900000000000006,2007,33.4,31382.351994000004,15436.974323999999,null,2007,"DAD"]
[176,null,"Thailand","UMIC",69518.554999999993,308326.31534480891,4440,"http://www.mof.go.th","Thailand Ministry of Finance",2,"http://dwfoc.mof.go.th/foc_eng/index.asp",2,"http://www.gfmis.go.th",1,"-",0,"-",0,1,"http://dwfoc.mof.go.th/crn/cgi-bin/cognosisapi.dll?b_action=xts.run&m=portal/view-output.xts&method=view&m_obj=defaultOutput(%2fcontent%2fpackage%5b%40name%3d%27Expense%27%5d%2ffolder%5b%40name%3d%27Expense%20English%27%5d%2ffolder%5b%40name%3d%27Expense%20Last%20Update%27%5d%2freport%5b%40name%3d%27Budget%20Appropriations%20Classicfied%20by%20Ministry%27%5d)&m_name=Budget%20Appropriations%20Classicfied%20by%20Ministry&CAMUsername=internet&CAMPassword=internet&format=HTML&backURL=%2fcrn%2fcgi-bin%2fcognosisapi.dll%3fb_action%3dxts.run%26m%3dportal%2fcc.xts%26m_path2%3d~%252ffolder%26m_path%3d%252fcontent%252fpackage%255b%2540name%253d%2527Expense%2527%255d%252ffolder%255b%2540name%253d%2527Expense%2520English%2527%255d%252ffolder%255b%2540name%253d%2527Expense%2520Last%2520Update%2527%255d",1,1,0,"-",1,"http://www.bb.go.th/bbhome/page.asp?option=content&dsc=%A4%D9%E8%C1%D7%CD%BB%AF%D4%BA%D1%B5%D4%A1%D2%C3%A8%D1%B4%B7%D3%A7%BA%BB%C3%D0%C1%D2%B3&folddsc=30001",1,1,2001,0,null,"-","-",0,null,"-",1,4,1,2001,1,1,2001,1,1,1,0,0,1,1,1,1,1,1,"http://www.gprocurement.go.th/wps/portal/index_EGP",0,"-",0,"-",1,"http://www.bb.go.th/bbhome/page.asp?option=content&dsc=%A1%D2%C3%A8%D1%B4%B7%D3%A7%BA%BB%C3%D0%C1%D2%B3%A8%D1%A7%CB%C7%D1%B4%E1%BA%BA%BA%D9%C3%B3%D2%A1%D2%C3&folddsc=21003",2,"http://web.nso.go.th","Thailand National Statistical Office","http://www.bot.or.th ","Bank of Thailand","http://dwfoc.mof.go.th/foc_eng/menu3.htm",0,"-",1,"http://www.bb.go.th/bbhome/page.asp?option=content&dsc=%A2%E9%CD%C1%D9%C5%A1%AE%CB%C1%D2%C2%E1%C5%D0%C3%D0%E0%BA%D5%C2%BA&folddsc=19001",2,"http://dw.mof.go.th/foc/gfs/knowledge.asp",0,3,"-","tha","eng","-","-",0,"GFMIS","Government Financial Management Information System","C","F",1,2004,"C+L",1,2,"SAP","Web","Oct 2009","Final","X","X","X","X","X","X","X","X","X","X",2.8333333333333335,3.125,36,42,null,2,92,0.50929999999999997,0.50980000000000003,0.2361,0.78190000000000004,"EAP",null,null,"APEC",null,"Thailand",9,3,5,1,null,1,null,null,1,null,null,15,57.692307692307686,"B",null,176,"Thailand","THA",2010,"<2",2011,13.2,264,9176.4492599999994,null,null,"DAD"]
[177,null,"Timor-Leste","LIC",1175.8800000000001,1054,896.34996768377721,"http://www.mof.gov.tl","Ministry of Finance",2,"http://www.mof.gov.tl/budget-spending/budget-execution/?lang=en",1,"http://www.mof.gov.tl/about-the-ministry/organisation-structure-roles-and-people/general-directorate-of-state-finances/treasury-directorate/financial-reporting/?lang=en",2,"http://budgettransparency.gov.tl/publicTransparency/transparencyNavigation;jsessionid=339D99EEF7F9956BC9CC3B72D562E5E9?isInflow=false&selectedGroupId=228&lang=en",1,"http://budgettransparency.gov.tl/publicTransparency/transparencyNavigation;jsessionid=339D99EEF7F9956BC9CC3B72D562E5E9?isInflow=false&selectedGroupId=228&lang=en",0,0,"-",2,1,0,"-",1,"http://www.mof.gov.tl/category/documents-and-forms/budget-documents/budget-codes/?lang=en",1,1,2006,0,null,"-","-",0,null,"-",1,4,1,2006,1,1,2006,1,1,0,0,0,1,1,0,0,0,1,"http://www.aidtransparency.gov.tl/",1,"http://www.transparency.gov.tl",0,"-",1,"http://www.estatal.gov.tl/Documents/Ministry/2008Policy/LG%20Policy%20and%20DSF%20-%20English.pdf",2,"http://dne.mof.gov.tl","National Statistics Directorate (Direcção Nacional de Estatística – DNE)","http://www.bancocentral.tl","Central Bank of Timor-Leste","http://www.governmentresults.gov.tl/publicResults/index?&lang=en",0,"-",1,"http://www.mof.gov.tl/about-the-ministry/legal-framework/?lang=en",0,"-",0,3,"-","tet","por","eng","-",0,"FMIS","Financial Management Information System","C","F",1,2011,"C+L",1,2,"FreeBalance","Web","Aug 2010","Public","B","A","B","D+","B","D","C+","C+","C+","D+",2.4500000000000002,2.0862068965517242,36,34,null,0,170,0.23649999999999999,0.2157,6.4899999999999999E-2,0.42899999999999999,"EAP",null,null,null,"F","Timor-Leste",0,null,null,null,null,0,null,null,null,null,null,16,61.53846153846154,"B",null,177,"Timor-Leste","TLS",null,null,2007,49.9,null,586.76412000000005,null,2011]
[178,null,"Togo","LIC",6154.8130000000001,3486.3851691379068,570,"http://www.republicoftogo.com/Toutes-les-rubriques/In-English","Togo Ministry of Finance and Economy / no website",0,"-",1,"http://www.sndi.ci/index.php/component/content/article/78.html",0,"-",0,"-",0,0,"-",0,0,0,"-",0,"-",0,null,"-",0,null,"-","-",0,null,"-",0,null,null,"-",0,null,"-",0,0,0,0,0,0,0,0,0,0,0,"-",0,"-",0,"-",0,"-",0,"http://www.stat-togo.org","Togo Direction Generale de la Statistique et de la Comptabilite","http://www.bceao.int ","Central Bank of West African States (BCEAO)","-",0,"-",0,"-",0,"-",0,0,"-","fre","eng","-","-",0,"SIGFIP","Système Intégré de Gestion des Finances Publiques","C","F",1,2010,"C+L",2,1,"LDSW > Oracle","Web","Mar 2009","Public","C","D","D","D","C","D","D","D","NA","D+",1.2777777777777777,1.5925925925925926,"-","-",null,0,178,0.21429999999999999,0.13730000000000001,7.4399999999999994E-2,0.43120000000000003,"AFR",null,null,null,"F","Togo",0,null,null,null,null,0,null,null,null,null,null,1,3.8461538461538463,"D",null,178,"Togo","TGO",2011,28.2,2011,58.7,1735.6572659999999,3612.8752310000004,null,2011]
[179,null,"Tonga","LMIC",104.509,398.97750870848631,3820,"http://www.finance.gov.to","Ministry of Finance and National Planning of the Kingdom of Tonga",2,"http://www.finance.gov.to/publications",1,"http://www.finance.gov.to/sites/default/files/TONGA_PEFA_2010.pdf#Top",1,"-",0,"-",0,0,"-",2,1,0,"-",1,"http://www.finance.gov.to/publications/treasury-manuals",1,1,2000,1,0,3,2009,0,null,"-",1,4,0,2005,1,0,2005,1,0,0,0,0,1,0,0,1,0,0,"-",0,"-",0,"-",0,"-",1,"http://www.spc.int/prism/country/to/stats","Tonga Statistics Department ","http://www.reservebank.to","National Reserve Bank of Tonga","-",0,"-",1,"http://www.finance.gov.to/about-us/legislations",0,"-",0,1,"-","eng","-","-","-","-","FMIS","Financial Management Information System","C","T",1,2005,"C",1,2,"SunSystems","Web","May 2010","Public","C","A","C","C","B","D","C+","D+","D+","D",2.0499999999999998,2.6071428571428572,"-","-",null,1,111,0.4405,0.24179999999999999,0.2069,0.87270000000000003,"EAP",null,null,null,null,"Tonga",0,null,null,null,null,0,null,null,null,null,null,13,50,"B",null,179,"Tonga","TON"]
[180,null,"Trinidad and Tobago","HIC",1346.35,22480,16696.995580643965,"http://www.finance.gov.tt","Ministry of Finance of the Republic of Trinidad and Tobago",2,"http://www.finance.gov.tt/publications.php?mid=3",1,"http://www.auditorgeneral.gov.tt/documentlibrary/downloads/9/Volume%20%20I%20Treasury%20Statments%20Funds%20Financial%20Statement%20-%20%20MOF%202010.pdf",1,"-",0,"-",0,0,"-",2,1,0,"-",1,"http://www.finance.gov.tt/content/pub164ADE.pdf.",1,1,2001,0,null,"-","-",0,null,"-",1,4,1,2010,0,null,"-",1,1,1,0,0,1,0,1,1,1,0,"-",0,"-",0,"-",1,"http://www.localgov.gov.tt",0,"http://www.cso.gov.tt","Central Statistics Office of Trinidad and Tobago","http://www.central-bank.org.tt","Central Bank of Trinidad and Tobago","-",0,"-",1,"http://www.finance.gov.tt/legislation.php?mid=6",0,"-",0,3,"-","eng","-","-","-","-","IFMIS","Integrated Financial Management Information System","C","F",4,2015,"C+L",1,1,"LDSW > FMIS","Web","Dec 2008","Public","C","B","B","C+","B","D","A","C+","B","D",2.5,2.6666666666666665,38,33,0,0,67,0.57310000000000005,0.48370000000000002,0.4526,0.78300000000000003,"LCR",null,null,null,null,"Trinidad and Tobago",0,null,null,null,null,0,null,null,null,null,null,12,46.153846153846153,"C",null,180,"Trinidad and Tobago","TTO",1992,4.2,null,null,56.546700000000001]
[181,null,"Tunisia","UMIC",10673.8,43443.062435107313,4070,"http://www.portail.finances.gov.tn","Republic of Tunisia Ministry of Finance",2,"http://www.portail.finances.gov.tn/accueil_fr.php#",1,"http://www.portail.finances.gov.tn/publications/Rapport-PEFA.pdf",1,"-",0,"-",0,0,"-",1,0,0,"-",0,"-",1,1,2010,0,null,"-","-",0,null,"-",1,4,1,2010,0,null,"-",1,0,0,0,0,1,0,0,1,0,0,"-",1,"http://www.opendata.tn",0,"-",1,"http://www.portail.finances.gov.tn/publications/Rapport-PEFA.pdf",0,"http://www.ins.nat.tn","Tunisia National Statistics Institute","http://www.bct.gov.tn ","Central Bank of Tunisia","-",0,"-",1,"http://www.portail.finances.gov.tn/accueil_fr.php#haut",2,"-",0,1,"-","ara","fre","-","-",0,"ADEB","Système Informatique d’Aide à la Décision Budgétaire / Budgetary Decision Support Information System","C","T",1,2003,"C",1,1,"LDSW","Web","Jun 2010","Public","C","A","B","C+","B+","B","B+","C+","D+","B",2.85,3.0483870967741935,11,"-",null,1,103,0.48330000000000001,0.47710000000000002,0.28860000000000002,0.68410000000000004,"MNA",null,null,null,null,"Tunisia",1,null,1,null,null,0,null,null,null,null,null,9,34.615384615384613,"C",null,181,"Tunisia","TUN",2010,"<2",2010,15.5,null,1654.4389999999999]
[182,null,"Turkey","UMIC",73639.596000000005,766620.9156603344,10410,"http://www.maliye.gov.tr","Turkish Ministry of Finance",2,"https://portal.muhasebat.gov.tr/mgmportal/faces/khb_yeni?_afrLoop=12996129006414294&_afrWindowMode=0&_adf.ctrl-state=xqzwghjpd_4",2,"https://www.kbs.gov.tr/Portal",3,"https://ebutce.bumko.gov.tr/ebutce2.htm",1,"https://ebutce.bumko.gov.tr/ebutce2.htm",0,1,"https://www.kbs.gov.tr/Portal/",2,1,1,"http://www.bumko.gov.tr/TR/Genel/BelgeGoster.aspx?F6E10F8892433CFFAC8287D72AD903BE95B604AA3C36F67D",1,"https://portal.muhasebat.gov.tr/mgmportal/faces/detaylihesap?_afrLoop=1626545447992604&_afrWindowMode=0&_adf.ctrl-state=16xvoe16xm_97",1,1,2004,1,1,3,2006,1,1,2004,1,2,1,2004,1,0,2004,1,1,1,0,0,1,1,0,1,1,1,"http://www.ihale.gov.tr/",1,"http://www.turkiye.gov.tr",1,"https://portal.muhasebat.gov.tr/mgmportal/faces/khbDetail?birimDizini=Municipalities&_afrLoop=1628532110622701&_afrWindowMode=0&_adf.ctrl-state=155046p7e2_114",1,"https://portal.muhasebat.gov.tr/mgmportal/faces/detaylihesap?_afrLoop=1628625001039383&_afrWindowMode=0&_adf.ctrl-state=155046p7e2_136",3,"http://www.turkstat.gov.tr","Turkish State Institute of Statistics","http://www.tcmb.gov.tr ","Türkiye Cumhuriyeti Merkez Bankası","http://www.hazine.gov.tr/irj/portal/anonymous?NavigationTarget=navurl://ca8a5b252efea63752b1cb4e1cc81997&InitialNodeFirstLevel=true",1,"http://www.maliye-behim.gov.tr/bes/",1,"http://www.bumko.gov.tr/TR/Genel/BelgeGoster.aspx?F6E10F8892433CFFAAF6AA849816B2EF8D40DBAF123EC275",2,"National accounting standards",0,3,"-","tur","eng","-","-",0,"say2000i / KBS","say2000i Accounting Office Automation System / Public Expenditure Mgmt and Accounting System","C","F",1,2001,"C+L",1,1,"LDSW > Ora / OSS","Web","Dec 2009","Final","X","X","X","X","X","X","X","X","X","X",3.2222222222222223,3.0535714285714284,50,57,1,2,80,0.52810000000000001,0.46410000000000001,0.3478,0.77259999999999995,"ECA",null,"OECD",null,null,"Turkey",1,null,null,null,1,0,null,null,null,null,null,23,88.461538461538453,"A",null,182,"Turkey","TUR",2010,"<2",2009,18.100000000000001,null,13328.766876000003]
[183,null,"Turkmenistan","UMIC",5105.3010000000004,24482.513140742863,4800,"http://www.turkmenistan.gov.tm","Ministry of Economy and Finance",0,"-",1,"http://ec.europa.eu/europeaid/documents/aap/2011/af_aap_2011_tkm.pdf",0,"-",0,"-",0,0,"-",0,0,0,"-",0,"-",0,null,"-",0,null,"-","-",0,null,"-",0,null,null,"-",0,null,"-",0,0,0,0,0,0,0,0,0,0,0,"-",0,"-",0,"-",0,"-",0,"http://www.stat.gov.tm","State Committee of Turkmenistan on Statistics","http://www.cbt.tm","Central Bank of Turkmenistan","-",0,"-",0,"-",0,"-",0,0,"-","tuk","-","-","-","-","GFMIS","Government Financial Management Information System","C","F",4,2014,"C+L",1,0,"?","Web","-","-","-","-","-","-","-","-","-","-","-","-","-","-","-","-",null,0,126,0.38129999999999997,0.1895,0.1139,0.84040000000000004,"ECA",null,null,null,null,"Turkmenistan",0,null,null,null,null,0,null,null,null,null,null,1,3.8461538461538463,"D",null,183,"Turkmenistan","TKM",1998,24.8,null,null,1266.1146480000002,null,null,null,"DAD"]
[184,null,"Tuvalu","UMIC",9.8469999999999995,48.780657337842641,4950,"http://www.tuvaluislands.com/gov_addresses.htm","Ministry of Finance and Economic Planning",0,"-",1,"http://www.pftac.org/filemanager/files/PFM/IFMIS_PICspdf1.pdf",0,"-",0,"-",0,0,"-",0,0,0,"-",0,"-",0,null,"-",0,null,"-","-",0,null,"-",0,null,null,"-",0,null,"-",0,0,0,0,0,0,0,0,0,0,0,"-",0,"-",0,"-",0,"-",0,"http://www.spc.int/prism/country/tv/stats","Central Statistics Division","-","National Bank of Tuvalu","-",0,"-",0,"-",0,"-",0,0,"-","eng","-","-","-","-","IFMIS","Integrated Financial Management Information System","C","T",1,1999,"C",1,2,"ACCPAC","Web","Jun 2011","Final","X","X","X","X","X","X","X","X","X","X",2.15,2.1129032258064515,"-","-",null,0,134,0.35389999999999999,5.2299999999999999E-2,0.18659999999999999,0.82279999999999998,"EAP",null,null,null,null,"Tuvalu",0,null,null,null,null,0,null,null,null,null,null,1,3.8461538461538463,"D",null,184,"Tuvalu","TUV"]
[185,null,"Uganda","LIC",34509.205000000002,17458.176645573727,510,"http://www.finance.go.ug","Ministry of Finance Planning and Economic Development",2,"http://www.finance.go.ug/index.php/national-budget/performance-reports.html",2,"http://www.finance.go.ug/index.php/ifms.html",1,"-",0,"-",0,0,"-",2,1,0,"-",0,"-",1,0,2009,1,0,3,2006,1,0,2011,1,4,1,2002,1,1,2007,1,1,0,0,0,1,0,0,1,0,1,"http://www.ppda.go.ug/",0,"-",0,"-",1,"http://www.finance.go.ug/index.php/ifms-archives.html",2,"http://www.ubos.org","Uganda Bureau of Statistics ","http://www.bou.or.ug ","Bank of Uganda","http://treasury.gov.ua/main/uk/publish/category/23593",0,"-",1,"http://www.finance.go.ug/index.php/key-legislations.html",0,"-",0,3,"-","eng","-","-","-","-","IFMS","Integrated Financial Management System","C","F",2,2006,"C+L",2,2,"Oracle","CS","Jun 2009","Public","A","A","B","C+","B","B","C+","C+","C+","C",2.9,2.370967741935484,65,55,null,2,143,0.31850000000000001,0.29409999999999997,7.3200000000000001E-2,0.58830000000000005,"AFR",null,null,null,null,"Uganda",0,null,null,null,null,0,null,null,null,null,null,15,57.692307692307686,"B",null,185,"Uganda","UGA",2009,38,2009,24.5,13113.4979,8454.7552250000008,null,2011]
[186,null,"Ukraine","LMIC",45706.1,142863.01992847837,3130,"http://www.minfin.gov.ua","Ministry of Finance of Ukraine",2,"http://www.minfin.gov.ua/control/uk/publish/archive/main?cat_id=77427",1,"http://www.minfin.gov.ua/control/uk/publish/article?art_id=283476&cat_id=283464",2,"http://www.treasury.gov.ua/main/uk/doccatalog/list?currDir=146477",1,"http://www.minfin.gov.ua/control/uk/publish/archive/main?cat_id=51703",0,0,"-",1,1,0,"-",1,"http://www.minfin.gov.ua/control/uk/publish/archive/main?cat_id=293534",1,1,1992,1,0,3,2010,0,null,"-",1,2,1,2003,1,1,1999,1,1,1,0,0,1,1,0,1,1,0,"-",0,"-",0,"-",1,"http://www.minfin.gov.ua/control/uk/publish/archive/main?&cat_id=288202&stind=1",3,"http://www.ukrstat.gov.ua","State Statistics Service of Ukraine ","http://www.bank.gov.ua ","National Bank of Ukraine","-",1,"http://www.kmu.gov.ua/control/uk/publish/officialcategory?cat_id=244394482",1,"http://www.minfin.gov.ua/control/uk/publish/category/main?cat_id=279322",0,"-",1,3,"Internet Forum","ukr","rus","eng","-",0,"PFMS","Public Financial Management System","C","T",1,2004,"C+L",1,1,"LDSW > Oracle","Web","2012-07-01","Public","A","A","B","C+","A","B","A","C+","D+","D",2.95,2.56,54,62,1,1,68,0.56530000000000002,0.42480000000000001,0.35349999999999998,0.91759999999999997,"ECA",null,null,null,null,"Ukraine",1,null,null,1,null,0,null,null,null,null,"2013-04-22",16,61.53846153846154,"B",null,186,"Ukraine","UKR",2010,"<2",2008,2.9,9,1325.4769000000001,null,null,"DAD"]
[187,null,"United Arab Emirates","HIC",7890.924,321664.61777158768,40760,"http://www.mof.gov.ae","United Arab Emirates Ministry of Finance and Industry",2,"http://www.mof.gov.ae/En/Publication/Pages/default.aspx",2,"http://www.mof.gov.ae/En/AboutMinistry/Projects/Pages/default.aspx",1,"-",0,"-",0,0,"-",1,0,0,"-",1,"http://dof.abudhabi.ae/_data/global/files/govtcoa.pdf",1,1,2008,1,0,3,2011,0,null,"-",1,4,1,2008,0,null,"-",1,1,0,0,0,0,0,0,1,1,1,"https://egov.uae.gov.ae/mofisite/arabic/default.asp",1,"http://www.government.ae/web/guest/uae-data",0,"-",0,"-",0,"http://www.economy.ae","United Arab Emirates Ministry of Economy","http://www.cbuae.gov.ae","Central Bank of United Arab Emirates","-",0,"-",1,"http://www.mof.gov.ae/En/AboutMinistry/Pages/OrganizationChart.aspx",0,"-",0,3,"-","ara","eng","-","-",0,"FMIS","Financial Management Information System","D","F",1,2010,"C+L",1,2,"Oracle","Web","-","-","-","-","-","-","-","-","-","-","-","-","-","-","-","-",null,0,28,0.73440000000000005,0.86270000000000002,0.55679999999999996,0.78369999999999995,"MNA",null,null,null,null,"United Arab Emirates",0,null,null,null,null,0,null,null,null,null,null,12,46.153846153846153,"C",null,187,"United Arab Emirates","ARE"]
[188,null,"United Kingdom","HIC",62641,2370444.9769933252,37840,"http://www.hm-treasury.gov.uk","United Kingdom HM Treasury",2,"http://www.hm-treasury.gov.uk/psr_index.htm",2,"http://data.gov.uk/dataset/oscar",3,"http://data.gov.uk/dataset/coins",1,"http://www.hm-treasury.gov.uk/psr_coins_data.htm",0,0,"-",2,1,2,"http://www.wheredoesmymoneygo.org/",1,"http://webarchive.nationalarchives.gov.uk/20100407010852/http://www.hm-treasury.gov.uk/psr_bac_classification_papers.htm",1,1,1999,1,1,5,1997,1,0,2002,1,4,1,1999,1,1,2004,1,1,1,0,0,1,1,1,1,1,1,"http://www.peppol.eu/",1,"http://data.gov.uk",0,"-",1,"http://www.communities.gov.uk/localgovernment/localgovernmentfinance/governmentaccounts/",0,"http://www.statistics.gov.uk","United Kingdom National Statistics","http://www.bankofengland.co.uk ","Bank of England","-",1,"http://www.justice.gov.uk/information-access-rights",1,"http://webarchive.nationalarchives.gov.uk/20100407010852/http://www.hm-treasury.gov.uk/spend_plancontrol.htm",0,"http://webarchive.nationalarchives.gov.uk/20100407010852/http://www.hm-treasury.gov.uk/pespub_index.htm",0,3,"-","eng","-","-","-","-","OSCAR (DW)","Online System for Central Accounting and Reporting","D","F",4,2014,"C",1,2,"COGNOS","Web","-","-","-","-","-","-","-","-","-","-","-","-","-","-",88,87,1,3,3,0.89600000000000002,0.97389999999999999,0.8135,0.90069999999999995,null,"EU","OECD",null,null,"United Kingdom",6,4,1,1,null,4,2,null,2,null,null,23,88.461538461538453,"A",null,188,"United Kingdom","GBR"]
[189,null,"United States of America","HIC",311591.91700000002,15148157.107358113,48620,"http://www.whitehouse.gov/omb","Office of Management and Budget / US Treasury / Agencies",2,"http://www.treasury.gov/about/budget-performance/Pages/default.aspx",2,"http://www.fms.treas.gov/index_systems.html",3,"http://www.usaspending.gov/data",1,"http://usaspending.gov/data",0,0,"-",2,1,1,"http://www.whitehouse.gov/omb",1,"http://www.whitehouse.gov/omb/circulars_a11_current_year_a11_toc",1,1,1996,1,1,10,1996,1,1,1996,1,2,1,1996,1,1,1996,1,1,1,0,0,1,1,0,1,1,1,"https://www.fpds.gov/fpdsng_cms/",1,"http://www.data.gov/opendatasites",0,"-",1,"http://www.fasab.gov/accounting-standards/authoritative-source-of-gaap/accounting-standards/fasab-handbook/",2,"http://www.fedstats.gov","United States Federal Statistics","http://www.federalreserve.gov","Board of Governors of the Federal Reserve System, Federal Reserve Bank of New York ","http://www.gpo.gov/help/about_fdsys2.htm",1,"http://fms.treas.gov/foia/index.html",1,"http://www.treasury.gov/open/Pages/default.aspx",0,"http://fms.treas.gov/eda/index.html",1,3,"-","eng","-","-","-","-","FMS","Financial Management System","D","F",1,1996,"C",1,1,"LDSW","Web","-","-","-","-","-","-","-","-","-","-","-","-","-","-",79,82,1,1,5,0.86870000000000003,1,0.68600000000000005,0.92020000000000002,null,"AME","OECD","APEC",null,"United States of America",8,2,4,null,2,26,6,8,5,7,"2013-05-08",23,88.461538461538453,"A",null,189,"United States of America","USA",null,null,null,null,null,null,null,null,"DAD"]
[190,null,"Uruguay","UMIC",3368.5949999999998,39956.299556009253,11860,"http://www.mef.gub.uy","Ministry of Economy and Finance / Ministerio de Economia y Finanzas",2,"http://www.cgn.gub.uy/",2,"http://www.cgn.gub.uy/innovaportal/v/600/1/innova.front/siif.html",1,"-",1,"http://www.mef.gub.uy/indicadores.php",0,0,"-",2,1,0,"-",0,"-",1,1,2005,1,1,5,2005,1,1,2010,1,4,1,1999,1,1,2010,1,1,1,0,0,1,1,1,1,1,1,"http://uca.mef.gub.uy/portal/web/guest/portada",1,"http://datos.gub.uy",0,"-",1,"http://www.mef.gub.uy/indicadores.php",2,"http://www.ine.gub.uy","Uruguay National Institute of Statistics ","http://www.bcu.gub.uy","Central Bank of Uruguay","http://www3.bcu.gub.uy/autoriza/sgoioi/nedd/sddsuruguay.html",1,"http://www.cgn.gub.uy/innovaportal/v/54/1/innova.front/acceso_a_la_informacion_publica.html",1,"http://www.cgn.gub.uy/innovaportal/v/262/1/innova.front/base_de_datos_juridica.html",0,"-",0,3,"-","spa","eng","-","-",0,"SIIF II","Sistema Integrado de Información Financiera / Integrated Financial Information System","C","F",1,1999,"C+L",1,1,"LDSW > Oracle","Web",2013,"-","-","-","-","-","-","-","-","-","-","-","-","-","-","-",1,1,50,0.63149999999999995,0.54900000000000004,0.44419999999999998,0.90129999999999999,"LCR",null,null,null,null,"Uruguay",0,null,null,null,null,1,null,null,1,null,null,19,73.076923076923066,"B",null,190,"Uruguay","URY",2010,"<2",2011,13.7,7,461.49751499999996]
[191,null,"Uzbekistan","LMIC",29341.200000000001,44232.011517550054,1510,"http://www.mf.uz","Ministry of Finance",1,"http://www.mf.uz/ru/gos-budjet.html",1,"http://pid.adb.org/pid/LoanView.htm?projNo=41041&seqNo=01&typeCd=3",1,"-",0,"-",0,0,"-",1,0,0,"-",0,"-",1,0,2006,0,null,"-","-",0,null,"-",1,4,0,2006,0,null,"-",1,0,0,0,0,0,0,0,0,0,1,"http://www.dgmarket.uz/",0,"-",0,"-",0,"-",0,"http://www.stat.uz","Ministry of Statistics","http://www.cbu.uz","Central Bank of the Republic of Uzbekistan","-",0,"-",1,"http://www.mf.uz/uz/gos-documents.html",0,"-",0,1,"-","uzb","rus","eng","-",0,"GFMIS","Government Financial Management Information System","C","F",3,2015,"C",1,0,"?","Web","-","-","-","-","-","-","-","-","-","-","-","-","-","-","-","-",null,1,91,0.50990000000000002,0.49669999999999997,0.20749999999999999,0.82550000000000001,"ECA",null,null,null,null,"Uzbekistan",0,null,null,null,null,0,null,null,null,null,null,6,23.076923076923077,"D",null,191,"Uzbekistan","UZB",null,null,null,null,null,null,null,null,"DAD"]
[192,null,"Vanuatu","LMIC",245.619,675.83121306151895,2750,"http://www.governmentofvanuatu.gov.vu","Vanuatu Ministry of Finance and Economic Management",2,"http://www.governmentofvanuatu.gov.vu/index.php?option=com_phocadownload&view=sections&Itemid=227",1,"http://www.pftac.org/filemanager/files/PFM/IFMIS_PICspdf1.pdf",1,"-",0,"-",0,0,"-",1,0,0,"-",0,"-",0,null,"-",0,null,"-","-",0,null,"-",0,null,null,"-",0,null,"-",1,0,0,0,0,0,0,0,0,0,0,"-",0,"-",0,"-",0,"-",0,"http://www.vnso.gov.vu","Vanuatu National Statistics Office","http://www.rbv.gov.vu","Reserve Bank of Vanuatu","-",0,"-",0,"-",0,"-",0,0,"-","eng","-","-","-","-","IFMIS","Integrated Financial Management Information System","C","F",1,2002,"C",1,2,"SmartStream","Web","Nov 2009","Final","X","X","X","X","X","X","X","X","X","X",2.5499999999999998,2.564516129032258,"-","-",null,2,135,0.35120000000000001,0.22220000000000001,0.17829999999999999,0.65310000000000001,"EAP",null,null,null,null,"Vanuatu",0,null,null,null,null,0,null,null,null,null,null,5,19.230769230769234,"D",null,192,"Vanuatu","VUT"]
[193,null,"Venezuela, RB","UMIC",29278,346137.93500546442,11820,"http://www.mppef.gob.ve","Venezuela Ministry of Planning and Finance",2,"http://www.mppef.gob.ve/index.php?option=com_content&view=article&id=242&Itemid=27",2,"http://www.oncop.gob.ve/vista/boton.php?var=sigecofx",1,"-",1,"http://www.mppef.gob.ve/index.php?option=com_content&view=article&id=245&Itemid=381",0,0,"-",2,1,0,"-",1,"http://www.ont.mf.gov.ve/index.php?option=com_filecabinet&view=files&id=39&Itemid=29",1,1,1998,0,null,"-","-",0,null,"-",1,3,1,1998,0,null,"-",1,1,1,0,0,1,0,1,1,0,0,"-",0,"-",0,"-",0,"-",2,"http://www.ine.gov.ve","Venezuela Central Office of Statistics and Informatics (INE)","http://www.bcv.org.ve","Central Bank of Venezuela","http://www.ont.mf.gov.ve/",0,"-",1,"http://www.mppef.gob.ve/index.php?option=com_content&view=article&id=148&Itemid=404",1,"-",0,3,"-","spa","-","-","-","-","SIGECOF","Sistema Integrado de Gestión y Control de las Finanzas Públicas / Integrated Administration and Control of Public Finance","C","F",1,2006,"C+L",1,1,"LDSW > Oracle","CS","-","-","-","-","-","-","-","-","-","-","-","-","-","-",37,34,null,1,71,0.5585,0.48370000000000002,0.32150000000000001,0.87050000000000005,"LCR",null,null,null,null,"Venezuela, RB",3,1,1,null,1,0,null,null,null,null,null,{"$f":"J195+L195+N195+P195+R195+S195+U195+V195+W195+Y195+AA195+AB195+AD195+AE195+AH195+AI195+AK195+AM195+AO195+AP195","v":14},53.846153846153847,"B",null,193,"Venezuela, RB","VEN",2006,6.6,2011,31.9,1932.348,9339.6819999999989]
[194,null,"Vietnam","LMIC",87840,111125.39666411589,1270,"http://www.mof.gov.vn","Vietnam Ministry of Finance",2,"http://www.mof.gov.vn/portal/page/portal/mof_en/State_Budget",1,"http://www.mof.gov.vn/portal/page/portal/mof_en/dn?pers_id=2420195&item_id=43684804&p_details=1",1,null,1,"http://www.mof.gov.vn/portal/page/portal/mof_en/State_Budget/dosb/ds/Final_accounts/70749475/70749598?p_folder_id=70428240&p_recurrent_news_id=70826023",0,0,"-",2,1,1,"http://www.mof.gov.vn/portal/page/portal/mof_vn/1351583/2126549/2117088",1,"http://www.mof.gov.vn/portal/page/portal//mof_vn/1351583/1371479",1,1,1998,0,null,"-","-",0,null,"-",1,2,1,2000,1,1,2003,1,1,1,0,0,1,1,1,1,1,0,"-",0,"-",2,"http://www.mof.gov.vn/portal/page/portal/mof_en/dn?pers_id=2420195&item_id=43684804&p_details=1",1,"http://www.mof.gov.vn/portal/page/portal/mof_vn/knd/1527141/1527171/74676643",3,"http://www.gso.gov.vn","Vietnam General Statistics Office","http://www.sbv.gov.vn","The State Bank of Vietnam","http://www.chinhphu.vn/portal/page/portal/chinhphu/solieungansachnhanuoc",0,"-",1,"http://www.mof.gov.vn/portal/page/portal/mof_en/ld",2,"GFS 2001",0,3,"-","vie","eng","-","-",1,"TABMIS","Treasury and Budget Management Information System","C","F",3,2013,"C+L",1,2,"Oracle","Web",2013,"-","-","-","-","-","-","-","-","-","-","-","-","-",19,14,null,1,83,0.52170000000000005,0.42480000000000001,0.39689999999999998,0.74339999999999995,"EAP",null,null,"APEC",null,{"$f":"C196","v":"Vietnam"},{"$f":"SUM(DS196:DV196)","v":4},2,null,1,1,{"$f":"SUM(DX196:EA196)","v":0},null,null,null,null,"2013-04-26",16,{"$f":"EC196/26*100","v":61.53846153846154},{"$f":"IF(ED196<25,\"D\",IF(ED196<50,\"C\",IF(ED196<75,\"B\",\"A\")))","v":"B"},null,194,"Vietnam","VNM",2008,16.899999999999999,2010,20.7,14844.959999999997,18182.88,null,null,"DAD"]
[195,null,"West Bank and Gaza","LIC",4019.433,4016,999.14589943407441,"http://www.pmof.ps","Ministry of Finance of the Palestinian Authority",1,"http://www.pmof.ps/en/web/guest/41",2,"http://www.bisan.com/?lang=en",1,"-",0,"-",0,0,"http://www.pmof.ps/news/plugins/spaw/uploads/files/General%20Government%20Operations%202010%20-%20statment%201.pdf",2,1,0,"-",0,"-",1,1,2008,0,null,"-","-",0,null,"-",1,2,1,2008,1,0,2009,1,1,0,0,0,1,1,0,1,0,0,"-",0,"-",0,"-",0,"-",0,"http://pcbs.gov.ps","Palestinian Authority Central Bureau of Statistics ","http://www.pma-palestine.org","Palestine Monetary Authority","-",0,"-",1,"http://www.pmof.ps/index.php?pagess=rules",1,"-",0,3,"-","ara","eng","-","-",0,"BISAN","Financial Management Information System","C","F",1,1997,"C+L",1,1,"LDSW > MS SQL","Web","Mar 2007","Public","D","B","C","D","C","D","B","D+","D","C",1.75,1.8888888888888888,"-","-",null,1,"-","-","-","-","-","MNA",null,null,null,"F","West Bank and Gaza",0,null,null,null,null,0,null,null,null,null,null,12,46.153846153846153,"C",null,195,"West Bank and Gaza","PSE",2009,"<2",2009,21.9,2,880.25582699999995]
[196,null,"Yemen","LMIC",24799.88,26419.202120074369,1070,"http://www.mof.gov.ye","Yemen Ministry of Finance",1,"http://www.mof.gov.ye/budget.html",1,"http://www.afmis.gov.ye",1,"-",0,"-",0,0,"-",1,1,0,"-",0,"-",1,0,2007,1,0,3,2011,0,null,"-",1,4,1,2007,0,null,"-",1,1,1,0,0,0,0,0,1,0,0,"-",0,"-",0,"-",0,"-",0,"http://www.cso-yemen.org","Yemen Central Statistical Organisation ","http://www.centralbank.gov.ye","Central Bank of Yemen","-",0,"-",1,"http://www.mof.gov.ye/mof-yemen/ministry-of-finance-yemen/mof-background.html",2,"-",0,1,"-","ara","-","-","-","-","AFMIS","Automated Financial Management Information System","C","F",2,2008,"C",1,1,"LDSW > Oracle","Web","Jun 2008","Public","C","A","C","B","B","B","D+","C+","B+","D+",2.6,2.3833333333333333,11,25,null,1,167,0.2472,0.17649999999999999,0.1011,0.4642,"MNA",null,null,null,"F","Yemen",0,null,null,null,null,0,null,null,null,null,null,9,34.615384615384613,"C",null,196,"Yemen","YEM",2005,17.5,2005,34.799999999999997,4339.9790000000003,8630.3582399999996,null,null,"DAD"]
[197,null,"Zambia","LMIC",13474.959000000001,15677.132855486232,1160,"http://www.mofnp.gov.zm","Zambia Ministry of Finance and National Planning",2,"http://www.mofnp.gov.zm/index.php?option=com_docman&Itemid=195",2,"http://www.mofnp.gov.zm/index.php?option=com_content&task=view&id=121&Itemid=130",1,"-",0,"-",0,1,"http://www.mofnp.gov.zm/index.php?option=com_docman&task=cat_view&gid=107&Itemid=122",1,0,1,"http://www.mofnp.gov.zm/index.php?option=com_content&task=view&id=41&Itemid=59",0,"-",1,0,2008,1,0,3,2008,1,0,2008,1,4,1,2004,0,null,"-",1,1,0,0,1,1,0,1,0,1,0,"No update after 2008",0,"-",0,"-",0,"-",2,"http://www.zamstats.gov.zm","Zambia Central Statistical Office","http://www.boz.zm","Central Bank of Zambia","http://www.mlgh.gov.zm/index.php?option=com_docman&Itemid=58",0,"-",1,"http://www.mofnp.gov.zm/index.php?option=com_content&task=view&id=72&Itemid=102",0,"-",0,1,"-","eng","-","-","-","-","IFMIS","Integrated Financial Management Information System","C","F",2,2012,"C+L",2,2,"SAP","Web","Jun 2008","Final","X","X","X","X","X","X","X","X","X","X",2.95,2.5,4,36,null,2,154,0.29099999999999998,0.31369999999999998,6.0100000000000001E-2,0.49930000000000002,"AFR",null,null,null,null,"Zambia",0,null,null,null,null,0,null,null,null,null,null,13,50,"B",null,197,"Zambia","ZMB",2006,68.5,2010,60.5,9230.3469150000001,8152.3501950000009,null,null,"DAD"]
[198,null,"Zimbabwe","LIC",12754.378000000001,8419.6792406400727,660,"http://www.zimtreasury.gov.zw","Zimbabwe Ministry of Finance",2,"http://www.zimtreasury.gov.zw/index.php?option=com_content&view=article&id=107&Itemid=71",1,"http://www.docstoc.com/docs/44898834/PUBLIC-FINANCE-MANAGEMENT-SYSTEM-IN-ZIMBABWE",1,"-",0,"-",0,0,"-",1,0,0,"-",0,"-",1,1,2008,0,null,"-","-",1,0,2011,1,4,1,2008,0,null,"-",1,1,0,0,0,1,0,0,0,0,0,"-",0,"-",0,"-",0,"http://repository.uwc.ac.za/xmlui/bitstream/handle/10566/208/DeVisserLocalGovtZimbabwe2010.pdf?sequence=4",0,"http://www.zimstat.co.zw","Zimbabwe Central Statistical Office","http://www.rbz.co.zw","Reserve Bank of Zimbabwe","-",0,"-",1,"http://www.zimtreasury.gov.zw/",0,"-",0,1,"-","eng","-","-","-","-","PFMS","Public Financial Management System","C","F",1,2005,"C+L",1,2,"SAP","Web","Nov 2011","Draft","X","X","X","X","X","X","X","X","X","X",2.4500000000000002,2.2000000000000002,20,"-",null,0,133,0.35830000000000001,0.30070000000000002,0.1099,0.66439999999999999,"AFR",null,null,null,"F","Zimbabwe",0,null,null,null,null,0,null,null,null,null,null,10,38.461538461538467,"C",null,198,"Zimbabwe","ZWE",null,null,2004,71,null,9055.6083799999997]
[]
[null,null,null,null,null,null,null,null,null,null,null,null,null,null,null,null,null,null,null,null,null,null,null,null,null,null,null,null,null,null,null,null,null,null,null,null,null,null,null,null,null,null,null,null,null,null,null,null,null,null,null,null,null,null,null,null,null,null,null,null,null,null,null,null,null,null,null,null,null,null,null,null,null,null,null,null,null,null,null,null,null,null,null,null,null,null,null,null,null,null,null,null,null,null,null,null,null,null,null,null,null,null,null,null,null,null,null,null,null,null,null,null,null,null,null,null,null,null,null,null,null,null,null,null,null,null,null,null,null,null,null,null,null,null,null,null,null,null,null,null,null,null,null,{"$f":"SUM(EN3:EN200)","v":1231892.6350739996},{"$f":"SUM(EO3:EO200)","v":1300155.834613},null,{"$f":"COUNTA(EQ3:EQ200)","v":23},{"$f":"COUNTA(ER3:ER200)","v":41}]
[null,null,null,"Econ",null,null,null,null,"Key Indicators >>> ",1,null,2,null,3,null,4,null,5,6,null,7,8,9,null,10,null,11,12,null,13,14,"Period",null,15,16,null,17,"Freq",18,null,19,20,null,21,22,23,24,25,26,27,28,29,30,null,null,31,null,32,null,33,null,34,null,null,null,null,"Informative >>>  ",35,null,36,null,37,null,38,39,null,40,null,null,null,null,null,null,"C / D","F / T","Stat","Op Yr","C+L","Type","ASW",null,"Arch","PEFA Cnt","Report",null,null,null,null,null,null,null,null,null,null,null,null,"OBI_12","OBI_10","OGP","MTEF","eGov12",null,null,null,null,null,null,null,null,null,"66 Economies > ",{"$f":"SUM(DR3:DR200)","v":227},69,66,60,32,117,25,19,52,21,{"$f":"+COUNTA(EB3:EB200)","v":43},null,null,"Group","Current gov practices in publishing open budget data from FMIS",null,null,null,null,null,null,null,124,112]
[null,null,"HIC",{"$f":"COUNTIF($D$3:$D$200,C204)","v":54},{"$f":"SUM(E3:E201)","v":6968359.3869999964},{"$f":"SUM(F3:F201)","v":66183097.654147647},{"$f":"AVERAGE(G3:G200)","v":14083.595292310347},null,null,{"$f":"COUNTIF(J$3:J$200,0)","v":32}," 0 = No PF dataset",{"$f":"COUNTIF($L$3:$L$200,0)","v":23},"0 =  No",{"$f":"COUNTIF(N$3:N$200,0)","v":32}," 0 = No PF dataset",{"$f":"COUNTIF(P$3:P$200,0)","v":146},"0 = No",{"$f":"COUNTIF(R$3:R$200,0)","v":180},{"$f":"COUNTIF(S$3:S$200,0)","v":170},null,{"$f":"COUNTIF(U$3:U$200,0)","v":32},{"$f":"COUNTIF(V$3:V$200,0)","v":50},{"$f":"COUNTIF(W$3:W$200,0)","v":149},null,{"$f":"COUNTIF(Y$3:Y$200,0)","v":105},null,{"$f":"COUNTIF(AA$3:AA$200,0)","v":45},{"$f":"COUNTIF(AB$3:AB$200,0)","v":33},null,{"$f":"COUNTIF(AD$3:AD$200,0)","v":95},{"$f":"COUNTIF(AE$3:AE$200,0)","v":39},{"$f":"COUNTIF(AF$2:AF$200,2)","v":3},"2-yr",{"$f":"COUNTIF(AH$3:AH$200,0)","v":154},{"$f":"COUNTIF(AI$3:AI$200,0)","v":12},null,{"$f":"COUNTIF(AK$3:AK$200,0)","v":51},{"$f":"COUNTIF($AL$3:$AL$200,1)","v":1},{"$f":"COUNTIF(AM$3:AM$200,0)","v":30},null,{"$f":"COUNTIF(AO$3:AO$200,0)","v":122},{"$f":"COUNTIF(AP$3:AP$200,0)","v":15},"< 0 >",{"$f":"COUNTIF(AR$3:AR$200,0)","v":58},53,138,168,174,53,73,121,92,145,140,null,{"$f":"COUNTIF(BD$3:BD$200,0)","v":137},null,{"$f":"COUNTIF(BF$3:BF$200,0)","v":170},null,{"$f":"COUNTIF(BH$3:BH$200,0)","v":131},null,{"$f":"COUNTIF(BJ$3:BJ$200,0)","v":100},null,null,null,null,null,{"$f":"COUNTIF(BP$3:BP$200,0)","v":145},null,{"$f":"COUNTIF(BR$3:BR$200,0)","v":55},null,{"$f":"COUNTIF(BT$3:BT$200,0)","v":134},null,{"$f":"COUNTIF(BV$3:BV$200,0)","v":169},{"$f":"COUNTIF(BW$3:BW$200,0)","v":25},"English",{"$f":"COUNTIF(BY$3:BY$200,\"eng\")","v":54},{"$f":"COUNTIF(BZ$3:BZ$200,\"eng\")","v":82},{"$f":"COUNTIF(CA$3:CA$200,\"eng\")","v":18},{"$f":"COUNTIF(CB$3:CB$200,\"eng\")","v":1},{"$f":"COUNTIF(CC$3:CC$200,0)","v":103},null,"Centralized",{"$f":"COUNTIF($CF$3:$CF$200,\"C\")","v":166},{"$f":"COUNTIF(CG$3:CG$200,\"F\")","v":119},{"$f":"COUNTIF(CH$3:CH$200,1)","v":116},{"$f":"COUNTIF(CI3:CI200,\"<2000\")","v":16},{"$f":"COUNTIF($CJ$3:$CJ$200,\"C\")","v":71},{"$f":"COUNTIF(CK$3:CK$200,1)","v":149},{"$f":"COUNTIF(CL$3:CL$200,2)","v":96},"COTS               Web",{"$f":"COUNTIF(CN$3:CN$200,\"Web\")","v":150},{"$f":"198-COUNTIF(CO3:CO200,\"-\")","v":129},{"$f":"198-COUNTIF(CP3:CP200,\"-\")","v":121},null,null,null,null,null,null,null,null,null,null,null,null,{"$f":"COUNTIF(DC3:DC200,\">=0\")","v":100},{"$f":"COUNTIF(DD3:DD200,\">=0\")","v":94},{"$f":"COUNTIF(DE$3:DE$200,0)","v":5},{"$f":"COUNTIF($DF$3:$DF$200,0)","v":49},{"$f":"COUNTIF(DG3:DG200,\">=0\")","v":190},null,null,null,null,null,null,null,null,null,null,"Central Gov policies",null,null,null,null,"State/Local Gov policies",null,null,null,null,null,{"$f":"EE204/$EE$208","v":0.12121212121212122},"A",{"$f":"COUNTIF($EE$3:$EE$200,ED204)","v":24}," Highly Visible",null,"(extensive infromation; FMIS is used to publish timely, reliable PF data; dynamic query options)"]
[null,null,"UMIC",{"$f":"COUNTIF($D$3:$D$200,C205)","v":52},null,null,null,null,null,{"$f":"COUNTIF(J$3:J$200,1)","v":41}," 1 = Difficult to see",{"$f":"COUNTIF($L$3:$L$200,1)","v":83},"1 = Yes, ref doc only",{"$f":"COUNTIF(N$3:N$200,1)","v":132}," 1 = Static",{"$f":"COUNTIF(P$3:P$200,1)","v":52},"1 = Yes",{"$f":"COUNTIF(R$3:R$200,1)","v":18},{"$f":"COUNTIF(S$3:S$200,1)","v":28},null,{"$f":"COUNTIF(U$3:U$200,1)","v":97},{"$f":"COUNTIF(V$3:V$200,1)","v":148},{"$f":"COUNTIF(W$3:W$200,1)","v":34},null,{"$f":"COUNTIF(Y$3:Y$200,1)","v":93},null,{"$f":"COUNTIF(AA$3:AA$200,1)","v":153},{"$f":"COUNTIF(AB$3:AB$200,1)","v":120},null,{"$f":"COUNTIF(AD$3:AD$200,1)","v":103},{"$f":"COUNTIF(AE$3:AE$200,1)","v":64},{"$f":"COUNTIF(AF$2:AF$200,3)","v":61},3,{"$f":"COUNTIF(AH$3:AH$200,1)","v":44},{"$f":"COUNTIF(AI$3:AI$200,1)","v":32},null,{"$f":"COUNTIF(AK$3:AK$200,1)","v":147},{"$f":"COUNTIF($AL$2:$AL$200,2)","v":50},{"$f":"COUNTIF(AM$3:AM$200,1)","v":117},null,{"$f":"COUNTIF(AO$3:AO$200,1)","v":76},{"$f":"COUNTIF(AP$3:AP$200,1)","v":61},"< 1 >",{"$f":"COUNTIF(AR$3:AR$200,1)","v":140},145,58,30,24,145,123,75,106,53,58,null,{"$f":"COUNTIF(BD$3:BD$200,1)","v":61},null,{"$f":"COUNTIF(BF$3:BF$200,1)","v":10},null,{"$f":"COUNTIF(BH$3:BH$200,1)","v":65},null,{"$f":"COUNTIF(BJ$3:BJ$200,1)","v":39},null,null,null,null,null,{"$f":"COUNTIF(BP$3:BP$200,1)","v":53},null,{"$f":"COUNTIF(BR$3:BR$200,1)","v":143},null,{"$f":"COUNTIF(BT$3:BT$200,1)","v":9},null,{"$f":"COUNTIF(BV$3:BV$200,1)","v":29},{"$f":"COUNTIF(BW$3:BW$200,1)","v":45},"French",{"$f":"COUNTIF(BY$3:BY$200,\"fre\")","v":23},{"$f":"COUNTIF(BZ$3:BZ$200,\"fre\")","v":8},{"$f":"COUNTIF(CA$3:CA$200,\"fre\")","v":0},{"$f":"COUNTIF(CB$3:CB$200,\"fre\")","v":0},{"$f":"COUNTIF(CC$3:CC$200,1)","v":6},null,"Decentralized",{"$f":"COUNTIF($CF$3:$CF$200,\"D\")","v":32},{"$f":"COUNTIF(CG$3:CG$200,\"T\")","v":58},{"$f":"COUNTIF(CH$3:CH$200,2)","v":9},{"$f":"COUNTIFS(CI4:CI201,\">=2000\",CI4:CI201,\"<2005\")","v":38},{"$f":"COUNTIF($CJ$3:$CJ$200,\"C+L\")","v":106},{"$f":"COUNTIF(CK$3:CK$200,2)","v":23},{"$f":"COUNTIF(CL$3:CL$200,1)","v":69},"LDSW                 CS",{"$f":"COUNTIF(CN$3:CN$200,\"CS\")","v":27},null,null,null,null,null,null,null,null,null,null,null,null,null,null,null,null,{"$f":"COUNTIF(DE$3:DE$200,1)","v":55},{"$f":"COUNTIF($DF$3:$DF$200,1)","v":71},null,null,null,null,null,null,null,null,null,null,null,null,null,null,null,null,null,null,null,null,null,null,{"$f":"EE205/$EE$208","v":0.34848484848484851},"B",{"$f":"COUNTIF($EE$3:$EE$200,ED205)","v":69}," Visible",null,"(significant information; static web pages/dataset updated regularly)"]
[null,null,"LMIC",{"$f":"COUNTIF($D$3:$D$200,C206)","v":54},"World",null,null,null,null,{"$f":"COUNTIF(J$3:J$200,2)","v":125}," 2 = Clearly visible",{"$f":"COUNTIF($L$3:$L$200,2)","v":92},"2 = Yes, web site",{"$f":"COUNTIF(N$3:N$200,2)","v":22}," 2 = Dynamic",{"$f":"SUM(P204:P205)","v":198},null,{"$f":"SUM(R204:R205)","v":198},{"$f":"SUM(S204:S205)","v":198},null,{"$f":"COUNTIF(U$3:U$200,2)","v":69},{"$f":"SUM(V204:V205)","v":198},{"$f":"COUNTIF(W$3:W$200,2)","v":15},null,{"$f":"SUM(Y204:Y205)","v":198},null,{"$f":"SUM(AA204:AA205)","v":198},{"$f":"SUM(AB204:AB205)","v":153},null,{"$f":"SUM(AD204:AD205)","v":198},{"$f":"SUM(AE204:AE205)","v":103},{"$f":"COUNTIF(AF$2:AF$200,4)","v":16},4,{"$f":"SUM(AH204:AH205)","v":198},{"$f":"SUM(AI204:AI205)","v":44},null,{"$f":"SUM(AK204:AK205)","v":198},{"$f":"COUNTIF($AL$2:$AL$200,3)","v":18},{"$f":"SUM(AM204:AM205)","v":147},null,{"$f":"SUM(AO204:AO205)","v":198},{"$f":"SUM(AP204:AP205)","v":76},"<n/a>",{"$f":"COUNTIF(AR$3:AR$200,\"n/a\")","v":0},0,2,0,0,0,2,2,0,0,0,null,{"$f":"SUM(BD204:BD205)","v":198},null,{"$f":"COUNTIF(BF$3:BF$200,2)","v":16},null,{"$f":"COUNTIF(BH$3:BH$200,\"n/a\")","v":2},null,{"$f":"COUNTIF(BJ$3:BJ$200,2)","v":36},null,null,null,null,null,{"$f":"SUM(BP204:BP205)","v":198},null,{"$f":"SUM(BR204:BR205)","v":198},null,{"$f":"COUNTIF(BT$3:BT$200,2)","v":55},null,{"$f":"SUM(BV204:BV205)","v":198},{"$f":"COUNTIF(BW$3:BW$200,2)","v":28},"Spanish",{"$f":"COUNTIF(BY$3:BY$200,\"spa\")","v":21},{"$f":"COUNTIF(BZ$3:BZ$200,\"spa\")","v":0},{"$f":"COUNTIF(CA$3:CA$200,\"spa\")","v":0},{"$f":"COUNTIF(CB$3:CB$200,\"spa\")","v":0},{"$f":"COUNTIF(CC$3:CC$200,\"-\")","v":89},null,null,null,null,{"$f":"COUNTIF(CH$3:CH$200,3)","v":47},{"$f":"COUNTIFS(CI5:CI201,\">=2005\",CI5:CI201,\"<2010\")","v":50},{"$f":"SUM(CJ204:CJ205)","v":177},{"$f":"COUNTIF(CK$3:CK$200,3)","v":2},{"$f":"COUNTIF(CL$3:CL$200,0)","v":12},"Unknown",{"$f":"SUM(CN204:CN205)","v":177},null,{"$f":"COUNTIF($CP$3:$CP$200,CQ206)","v":66},"Public",null,null,null,null,null,null,null,null,null,null,null,null,null,{"$f":"SUM(DE204:DE205)","v":60},{"$f":"COUNTIF($DF$3:$DF$200,2)","v":42},null,null,null,null,null,null,null,null,null,null,"EU",{"$f":"SUM(DS206:DV206)","v":15},5,9,1,null,null,null,null,null,null,null,{"$f":"EE206/$EE$208","v":0.30808080808080807},"C",{"$f":"COUNTIF($EE$3:$EE$200,ED206)","v":61}," Limited Visibility",null,"(some information; ongoing activities to improve web content or publish PF data)"]
[null,null,"LIC",{"$f":"COUNTIF($D$3:$D$200,C207)","v":38},6840507.0025393004,62492517.230076395,9135.6557645329904,null,null,{"$f":"SUM(J204:J206)","v":198},null,{"$f":"SUM(L204:L206)","v":198},null,{"$f":"COUNTIF(N$3:N$200,3)","v":12}," 3 = Dynamic",null,null,null,null,null,{"$f":"SUM(U204:U206)","v":198},null,{"$f":"SUM(W204:W206)","v":198},null,null,null,null,null,null,null,null,{"$f":"COUNTIF(AF$2:AF$200,5)","v":22},5,null,null,null,null,{"$f":"COUNTIF($AL$2:$AL$200,4)","v":78},null,null,null,null,null,{"$f":"SUM(AR204:AR206)","v":198},{"$f":"SUM(AS204:AS206)","v":198},198,198,198,198,198,198,198,198,198,null,null,null,{"$f":"COUNTIF(BF$3:BF$200,\"n/a\")","v":2},null,{"$f":"SUM(BH204:BH206)","v":198},null,{"$f":"COUNTIF(BJ$3:BJ$200,3)","v":23},null,null,null,null,null,null,null,null,null,{"$f":"SUM(BT204:BT206)","v":198},null,null,{"$f":"COUNTIF(BW$3:BW$200,3)","v":100},"Arabic",{"$f":"COUNTIF(BY$3:BY$200,\"ara\")","v":18},{"$f":"COUNTIF(BZ$3:BZ$200,\"ara\")","v":3},{"$f":"COUNTIF(CA$3:CA$200,\"ara\")","v":0},{"$f":"COUNTIF(CB$3:CB$200,\"ara\")","v":0},null,null,null,null,null,{"$f":"COUNTIF(CH$3:CH$200,4)","v":5},{"$f":"COUNTIF(CI3:CI200,\">=2010\")","v":73},null,{"$f":"COUNTIF(CK$3:CK$200,4)","v":1},{"$f":"SUM(CL204:CL206)","v":177},null,null,null,{"$f":"COUNTIF($CP$3:$CP$200,CQ207)","v":32},"Final",null,null,null,null,null,null,null,null,null,null,null,null,null,null,{"$f":"COUNTIF($DF$3:$DF$200,3)","v":19},null,null,null,null,null,null,null,null,null,null,"OECD",{"$f":"SUM(DS207:DV207)","v":1},null,1,null,null,null,null,null,null,null,null,{"$f":"EE207/$EE$208","v":0.22222222222222221},"D",{"$f":"COUNTIF($EE$3:$EE$200,ED207)","v":44}," Minimal Visibility",null,"(minimal or no information; no MoF web site or PF data)"]
[null,null,null,{"$f":"SUM(D204:D207)","v":198},null,null,null,null,null,null,null,null,null,{"$f":"SUM(N204:N207)","v":198},null,null,null,null,null,null,null,null,null,null,null,null,null,null,null,null,null,{"$f":"COUNTIF(AF$2:AF$200,AG208)","v":1},"> 5",null,null,null,null,{"$f":"SUM(AL204:AL207)","v":147},null,null,null,null,null,null,null,null,null,null,null,null,null,null,null,null,null,null,null,{"$f":"SUM(BF204:BF207)","v":198},null,null,null,{"$f":"SUM(BJ204:BJ207)","v":198},null,null,null,null,null,null,null,null,null,null,null,null,{"$f":"SUM(BW204:BW207)","v":198},"Russian",{"$f":"COUNTIF(BY$3:BY$200,\"rus\")","v":3},{"$f":"COUNTIF(BZ$3:BZ$200,\"rus\")","v":6},{"$f":"COUNTIF(CA$3:CA$200,\"rus\")","v":1},{"$f":"COUNTIF(CB$3:CB$200,\"rus\")","v":0},null,null,null,null,null,{"$f":"SUM(CH204:CH207)","v":177},{"$f":"SUM(CI204:CI207)","v":177},null,{"$f":"COUNTIF(CK$3:CK$200,5)","v":2},21,"No FMIS yet",null,null,{"$f":"COUNTIF($CP$3:$CP$200,CQ208)","v":23},"Draft",null,null,null,null,null,null,null,null,null,null,null,null,null,null,{"$f":"SUM(DF204:DF207)","v":181},null,null,null,null,null,null,null,null,null,null,"UN",2,null,2,null,null,null,null,null,null,null,null,null,null,{"$f":"SUM(EE204:EE207)","v":198}]
[null,null,null,null,null,null,null,null,null,null,null,null,null,null,null,null,null,null,null,null,null,null,null,null,null,null,null,null,null,null,null,{"$f":"SUM(AF204:AF208)","v":103},null,null,null,null,null,null,null,null,null,null,null,null,null,null,null,null,null,null,null,null,null,null,null,null,null,null,null,null,null,null,null,null,null,null,null,null,null,null,null,null,null,null,null,"Portuguese",{"$f":"COUNTIF(BY$3:BY$200,\"por\")","v":7},{"$f":"COUNTIF(BZ$3:BZ$200,\"por\")","v":1},{"$f":"COUNTIF(CA$3:CA$200,\"por\")","v":1},{"$f":"COUNTIF(CB$3:CB$200,\"por\")","v":0},null,null,null,null,null,null,null,null,{"$f":"SUM(CK204:CK208)","v":177},null,null,null,null,{"$f":"SUM(CP206:CP208)","v":121},null,null,null,null,null,null,null,null,null,null,null,null,null,null,null,null,null,null,null,null,null,null,null,null,null,null,null,{"$f":"SUM(DS206:DU208)","v":18},null,null,null,null,null,null,null,null,null,null,"Avg Score >",{"$f":"AVERAGE(ED3:ED200)","v":45.163170163170193}]
[null,null,null,null,null,null,null,null,null,null,null,null,null,null,null,null,null,null,null,null,null,null,null,null,null,null,null,null,null,null,null,null,null,null,null,null,null,null,null,null,null,null,null,null,null,null,null,null,null,null,null,null,null,null,null,null,null,null,null,null,null,null,null,null,null,null,null,null,null,null,null,null,null,null,null,"Chinese",{"$f":"COUNTIF(BY$3:BY$200,\"chi\")","v":4},{"$f":"COUNTIF(BZ$3:BZ$200,\"chi\")","v":0},{"$f":"COUNTIF(CA$3:CA$200,\"chi\")","v":0},{"$f":"COUNTIF(CB$3:CB$200,\"chi\")","v":0}]
[null,null,"FMIS World Map:",null,null,null,null,null,null,null,null,null,null,null,null,null,null,null,null,null,null,null,null,null,null,null,null,"Historical trends in publishing PF information",null,null,null,null,null,null,null,null,null,null,null,null,null,null,null,null,null,null,null,null,null,null,null,null,null,null,null,null,null,null,null,null,null,null,null,null,null,null,null,null,null,null,null,null,null,null,null,"German",{"$f":"COUNTIF(BY$3:BY$200,\"ger\")","v":4},{"$f":"COUNTIF(BZ$3:BZ$200,\"ger\")","v":0},{"$f":"COUNTIF(CA$3:CA$200,\"ger\")","v":0},{"$f":"COUNTIF(CB$3:CB$200,\"ger\")","v":1},null,null,null,null,null,null,null,null,null,null,null,null,null,null,null,null,null,null,null,null,null,null,null,null,null,null,null,null,null,null,null,null,null,null,null,null,null,null,null,null,"Total # of policies > ",{"$f":"DR203+DW203+DR209","v":362},{"$f":"DS203+DX203+DS206","v":99},{"$f":"DT203+DY203+SUM(DT206:DT208)","v":97},{"$f":"DU203+DZ203+DU206","v":113},{"$f":"DV203+EA203","v":53}]
[null,null,"http://maps.google.com/maps/ms?ie=UTF&msa=0&msid=213542822110887565899.0004c2f44512d9ce6795f",null,null,null,null,null,null,null,null,null,null,null,null,null,null,null,null,null,null,null,null,null,null,null,null,">=1980",{"$f":"COUNTIFS(AC$2:AC$200,$AB$212,AC$2:AC$200,$AD$212)+1","v":3},"<=1989",null,null,{"$f":"COUNTIFS(AG$2:AG$200,$AB$212,AG$2:AG$200,$AD$212)","v":0},null,null,{"$f":"COUNTIFS(AJ$2:AJ$200,$AB$212,AJ$2:AJ$200,$AD$212)","v":0},null,null,null,{"$f":"COUNTIFS(AN$2:AN$200,$AB$212,AN$2:AN$200,$AD$212)","v":2},null,null,{"$f":"COUNTIFS(AQ$2:AQ$200,$AB$212,AQ$2:AQ$200,$AD$212)","v":0},null,null,null,null,null,null,null,null,null,null,null,null,null,null,null,null,null,null,null,null,null,null,null,null,null,null,null,null,null,null,null,null,"Dutch",{"$f":"COUNTIF(BY$3:BY$200,\"dut\")","v":3},{"$f":"COUNTIF(BZ$3:BZ$200,\"dut\")","v":0},{"$f":"COUNTIF(CA$3:CA$200,\"dut\")","v":0},{"$f":"COUNTIF(CB$3:CB$200,\"dut\")","v":0}]
[null,null,null,null,null,null,null,null,null,null,null,null,null,null,null,null,null,null,null,null,null,null,null,null,null,null,null,">=1990",{"$f":"COUNTIFS(AC$2:AC$200,$AB$213,AC$2:AC$200,$AD$213)","v":29},"<=1999",null,null,{"$f":"COUNTIFS(AG$2:AG$200,$AB$213,AG$2:AG$200,$AD$213)","v":12},null,null,{"$f":"COUNTIFS(AJ$2:AJ$200,$AB$213,AJ$2:AJ$200,$AD$213)","v":6},null,null,null,{"$f":"COUNTIFS(AN$2:AN$200,$AB$213,AN$2:AN$200,$AD$213)","v":27},null,null,{"$f":"COUNTIFS(AQ$2:AQ$200,$AB$213,AQ$2:AQ$200,$AD$213)","v":13},null,null,null,null,null,null,null,null,null,null,null,null,null,null,null,null,null,null,null,null,null,null,null,null,null,null,null,null,null,null,null,null,"other",{"$f":"198-SUM(BY204:BY212)-BY214","v":61},{"$f":"198-SUM(BZ204:BZ212)-BZ214","v":9},{"$f":"198-SUM(CA204:CA212)-CA214","v":4},{"$f":"198-SUM(CB204:CB212)-CB214","v":2}]
[null,null,null,null,null,null,null,null,null,null,null,null,null,null,null,null,null,null,null,null,null,null,null,null,null,null,null,">=2000",{"$f":"COUNTIFS(AC$2:AC$200,$AB$214,AC$2:AC$200,$AD$214)","v":104},"<=2009",null,null,{"$f":"COUNTIFS(AG$2:AG$200,$AB$214,AG$2:AG$200,$AD$214)","v":58},null,null,{"$f":"COUNTIFS(AJ$2:AJ$200,$AB$214,AJ$2:AJ$200,$AD$214)","v":30},null,null,null,{"$f":"COUNTIFS(AN$2:AN$200,$AB$214,AN$2:AN$200,$AD$214)","v":103},null,null,{"$f":"COUNTIFS(AQ$2:AQ$200,$AB$214,AQ$2:AQ$200,$AD$214)","v":55},null,null,null,null,null,null,null,null,null,null,null,null,null,null,null,null,null,null,null,null,null,null,null,null,null,null,null,null,null,null,null,null,"n/a",{"$f":"COUNTIF(BY$3:BY$200,\"-\")","v":0},{"$f":"COUNTIF(BZ$3:BZ$200,\"-\")","v":89},{"$f":"COUNTIF(CA$3:CA$200,\"-\")","v":174},{"$f":"COUNTIF(CB$3:CB$200,\"-\")","v":194}]
[null,null,null,null,null,null,null,null,null,null,null,null,null,null,null,null,null,null,null,null,null,null,null,null,null,null,null,">=2010",{"$f":"COUNTIFS(AC$2:AC$200,$AB$215,AC$2:AC$200,$AD$215)","v":17},"<=2013",null,null,{"$f":"COUNTIFS(AG$2:AG$200,$AB$215,AG$2:AG$200,$AD$215)","v":33},null,null,{"$f":"COUNTIFS(AJ$2:AJ$200,$AB$215,AJ$2:AJ$200,$AD$215)","v":8},null,null,null,{"$f":"COUNTIFS(AN$2:AN$200,$AB$215,AN$2:AN$200,$AD$215)","v":15},null,null,{"$f":"COUNTIFS(AQ$2:AQ$200,$AB$215,AQ$2:AQ$200,$AD$215)","v":8},null,null,null,null,null,null,null,null,null,null,null,null,null,null,null,null,null,null,null,null,null,null,null,null,null,null,null,null,null,null,null,null,null,{"$f":"SUM(BY204:BY214)","v":198},{"$f":"SUM(BZ204:BZ214)","v":198},{"$f":"SUM(CA204:CA214)","v":198},{"$f":"SUM(CB204:CB214)","v":198}]
[null,null,null,null,null,null,null,null,null,null,null,null,null,null,null,null,null,null,null,null,null,null,null,null,null,null,null,null,{"$f":"SUM(AC212:AC215)","v":153},null,null,null,{"$f":"SUM(AG212:AG215)","v":103},null,null,{"$f":"SUM(AJ212:AJ215)","v":44},null,null,null,{"$f":"SUM(AN212:AN215)","v":147},null,null,{"$f":"SUM(AQ212:AQ215)","v":76}]
[null,null,null,null,null,null,null,null,null,null,null,null,null,null,null,null,null,null,null,null,null,null,null,null,null,null,null,null,{"$f":"AC216/198","v":0.77272727272727271},null,null,null,{"$f":"AG216/198","v":0.52020202020202022},null,null,{"$f":"AJ216/198","v":0.22222222222222221},null,null,null,{"$f":"AN216/198","v":0.74242424242424243},null,null,{"$f":"AQ216/198","v":0.38383838383838381}]
[null,null,null,null,null,null,null,null,null,null,null,null,null,null,null,null,null,null,null,null,null,null,null,null,null,null,null,"Regular publication trends"]
[null,null,null,null,null,null,null,null,null,null,null,null,null,null,null,null,null,null,null,null,null,null,null,null,null,null,null,">=1980",{"$f":"COUNTIFS(AC$2:AC$200,$AB$212,AC$2:AC$200,$AD$212,AB$2:AB$200,1)+1","v":3},"<=1989",null,null,{"$f":"COUNTIFS(AG$2:AG$200,$AB$212,AG$2:AG$200,$AD$212,AE$2:AE$200,1)","v":0},null,null,{"$f":"COUNTIFS(AJ$2:AJ$200,$AB$212,AJ$2:AJ$200,$AD$212,AI$2:AI$200,1)","v":0},null,null,null,{"$f":"COUNTIFS(AN$2:AN$200,$AB$212,AN$2:AN$200,$AD$212,AM$2:AM$200,1)","v":1},null,null,{"$f":"COUNTIFS(AQ$2:AQ$200,$AB$212,AQ$2:AQ$200,$AD$212,AP$2:AP$200,1)","v":0}]
[null,null,null,null,null,null,null,null,null,null,null,null,null,null,null,null,null,null,null,null,null,null,null,null,null,null,null,">=1990",{"$f":"COUNTIFS(AC$2:AC$200,$AB$213,AC$2:AC$200,$AD$213,AB$2:AB$200,1)","v":29},"<=1999",null,null,{"$f":"COUNTIFS(AG$2:AG$200,$AB$213,AG$2:AG$200,$AD$213,AE$2:AE$200,1)","v":12},null,null,{"$f":"COUNTIFS(AJ$2:AJ$200,$AB$213,AJ$2:AJ$200,$AD$213,AI$2:AI$200,1)","v":6},null,null,null,{"$f":"COUNTIFS(AN$2:AN$200,$AB$213,AN$2:AN$200,$AD$213,AM$2:AM$200,1)","v":27},null,null,{"$f":"COUNTIFS(AQ$2:AQ$200,$AB$213,AQ$2:AQ$200,$AD$213,AP$2:AP$200,1)","v":13}]
[null,null,null,null,null,null,null,null,null,null,null,null,null,null,null,null,null,null,null,null,null,null,null,null,null,null,null,">=2000",{"$f":"COUNTIFS(AC$2:AC$200,$AB$214,AC$2:AC$200,$AD$214,AB$2:AB$200,1)","v":80},"<=2009",null,null,{"$f":"COUNTIFS(AG$2:AG$200,$AB$214,AG$2:AG$200,$AD$214,AE$2:AE$200,1)","v":44},null,null,{"$f":"COUNTIFS(AJ$2:AJ$200,$AB$214,AJ$2:AJ$200,$AD$214,AI$2:AI$200,1)","v":22},null,null,null,{"$f":"COUNTIFS(AN$2:AN$200,$AB$214,AN$2:AN$200,$AD$214,AM$2:AM$200,1)","v":81},null,null,{"$f":"COUNTIFS(AQ$2:AQ$200,$AB$214,AQ$2:AQ$200,$AD$214,AP$2:AP$200,1)","v":46}]
[null,null,"“It is possible to fly without motors, but not without knowledge and skill.” ~ Wilbur and Orville Wright",null,null,null,null,null,null,null,null,null,null,null,null,null,null,null,null,null,null,null,null,null,null,null,null,">=2010",{"$f":"COUNTIFS(AC$2:AC$200,$AB$215,AC$2:AC$200,$AD$215,AB$2:AB$200,1)","v":8},"<=2013",null,null,{"$f":"COUNTIFS(AG$2:AG$200,$AB$215,AG$2:AG$200,$AD$215,AE$2:AE$200,1)","v":8},null,null,{"$f":"COUNTIFS(AJ$2:AJ$200,$AB$215,AJ$2:AJ$200,$AD$215,AI$2:AI$200,1)","v":4},null,null,null,{"$f":"COUNTIFS(AN$2:AN$200,$AB$215,AN$2:AN$200,$AD$215,AM$2:AM$200,1)","v":8},null,null,{"$f":"COUNTIFS(AQ$2:AQ$200,$AB$215,AQ$2:AQ$200,$AD$215,AP$2:AP$200,1)","v":2}]
[null,null,null,null,null,null,null,null,null,null,null,null,null,null,null,null,null,null,null,null,null,null,null,null,null,null,null,null,{"$f":"SUM(AC219:AC222)","v":120},null,null,null,{"$f":"SUM(AG219:AG222)","v":64},null,null,{"$f":"SUM(AJ219:AJ222)","v":32},null,null,null,{"$f":"SUM(AN219:AN222)","v":117},null,null,{"$f":"SUM(AQ219:AQ222)","v":61}]
[null,null,null,null,null,null,null,null,null,null,null,null,null,null,null,null,null,null,null,null,null,null,null,null,null,null,null,null,{"$f":"AC223/198","v":0.60606060606060608},null,null,null,{"$f":"AG223/198","v":0.32323232323232326},null,null,{"$f":"AJ223/198","v":0.16161616161616163},null,null,null,{"$f":"AN223/198","v":0.59090909090909094},null,null,{"$f":"AQ223/198","v":0.30808080808080807}]

{"sheet":"Stats","index":1,"n_rows":164,"n_cols":83,"rows_kept":164,"cut":false,"hidden":false,"merged":[[1,37,1,42],[1,51,1,56]]}
[null,null,null,null,null,null,null,null,null,null,null,null,null,null,null,null,null,null,null,null,null,null,null,null,null,null,null,null,null,null,null,null,null,null,null,null,null,"FMIS & OBD data set (198 economies)",null,null,null,null,null,null,null,null,null,null,null,null,null,"FMIS & OBD data set (Regions)",null,null,null,null,null,null,null,null,null,null,null,"OBI > 100 economies",null,null,null,null,"PEFA > 121 economies",null,null,null,null,null,null,null,null,null,null,"PEFA > 65 economies (public)"]
[null,"Current status of gov practices in publishing Open Budget Data from FMIS",null,null,null,null,null,null,null,null,null,null,null,null,null,null,null,null,null,"Income level distribution",null,null,null,null,null,null,"Regional distribution",null,null,null,null,null,null,null,null,null,null,"# of Economies by Indicators ",null,null,null,null,null,null,null,null,null,null,null,null,null,"# of Countries by Indicators ",null,null,null,null,null,null,null,null,null,null,null,"Open Budget Index vs. FMIS & OBD Scores",null,null,null,null,"PEFA (Avg 10 and All) vs. FMIS & OBD Scores",null,null,null,null,null,null,null,null,null,null,"PEFA (Avg 10 and All) vs. FMIS & OBD Scores"]
[null,"Econ","A","B","C","D","Sum",null,"Region","A","B","C","D","Sum",null,null,null,null,null,"Econ",0,1,2,3,"Sum",null,"Region",0,1,2,3,"Sum",null,null,null,null,"#","Ind",0,1,2,3,"Total","ref","quest",null,0,1,2,3,null,"Ind",0,1,2,3,"Total",null,0,1,2,3,null,"Economy","Econ","Scores","OBI",null,"Economy","Scores","Avg10","Avg",null,null,null,null,null,null,null,"Economy","Scores","Avg10","Avg"]
[null,"HIC",{"$f":"COUNTIFS('FMIS and OBD'!$EE$3:$EE$200,C$3,'FMIS and OBD'!$D$3:$D$200,$B4)","v":11},{"$f":"COUNTIFS('FMIS and OBD'!$EE$3:$EE$200,D$3,'FMIS and OBD'!$D$3:$D$200,$B4)","v":21},{"$f":"COUNTIFS('FMIS and OBD'!$EE$3:$EE$200,E$3,'FMIS and OBD'!$D$3:$D$200,$B4)","v":14},{"$f":"COUNTIFS('FMIS and OBD'!$EE$3:$EE$200,F$3,'FMIS and OBD'!$D$3:$D$200,$B4)","v":8},{"$f":"SUM(C4:F4)","v":54},null,"AFR",{"$f":"COUNTIFS('FMIS and OBD'!$EE$3:$EE$200,C$3,'FMIS and OBD'!$DL$3:$DL$200,$I4)","v":0},{"$f":"COUNTIFS('FMIS and OBD'!$EE$3:$EE$200,D$3,'FMIS and OBD'!$DL$3:$DL$200,$I4)","v":11},{"$f":"COUNTIFS('FMIS and OBD'!$EE$3:$EE$200,E$3,'FMIS and OBD'!$DL$3:$DL$200,$I4)","v":18},{"$f":"COUNTIFS('FMIS and OBD'!$EE$3:$EE$200,F$3,'FMIS and OBD'!$DL$3:$DL$200,$I4)","v":19},{"$f":"SUM(J4:M4)","v":48},null,"Gov Practices > OBD from FMIS",null,null,null,"HIC",{"$f":"COUNTIFS(INDIRECT(\"'FMIS and OBD'!$\"&$Z$16&\"$3:$\"&$Z$16&\"$200\"),U$3,'FMIS and OBD'!$D$3:$D$200,$T4)","v":12},{"$f":"COUNTIFS(INDIRECT(\"'FMIS and OBD'!$\"&$Z$16&\"$3:$\"&$Z$16&\"$200\"),V$3,'FMIS and OBD'!$D$3:$D$200,$T4)","v":42},{"$f":"COUNTIFS(INDIRECT(\"'FMIS and OBD'!$\"&$Z$16&\"$3:$\"&$Z$16&\"$200\"),W$3,'FMIS and OBD'!$D$3:$D$200,$T4)","v":0},{"$f":"COUNTIFS(INDIRECT(\"'FMIS and OBD'!$\"&$Z$16&\"$3:$\"&$Z$16&\"$200\"),X$3,'FMIS and OBD'!$D$3:$D$200,$T4)","v":0},{"$f":"SUM(U4:X4)","v":54},null,"AFR",{"$f":"COUNTIFS(INDIRECT(\"'FMIS and OBD'!$\"&$Z$16&\"$3:$\"&$Z$16&\"$200\"),AB$3,'FMIS and OBD'!$DL$3:$DL$200,$AA4)","v":20},{"$f":"COUNTIFS(INDIRECT(\"'FMIS and OBD'!$\"&$Z$16&\"$3:$\"&$Z$16&\"$200\"),AC$3,'FMIS and OBD'!$DL$3:$DL$200,$AA4)","v":28},{"$f":"COUNTIFS(INDIRECT(\"'FMIS and OBD'!$\"&$Z$16&\"$3:$\"&$Z$16&\"$200\"),AD$3,'FMIS and OBD'!$DL$3:$DL$200,$AA4)","v":0},{"$f":"COUNTIFS(INDIRECT(\"'FMIS and OBD'!$\"&$Z$16&\"$3:$\"&$Z$16&\"$200\"),AE$3,'FMIS and OBD'!$DL$3:$DL$200,$AA4)","v":0},{"$f":"SUM(AB4:AE4)","v":48},null,null,null,null,1,1,{"$f":"COUNTIF('FMIS and OBD'!$J$3:$J$200,AM$3)","v":32},{"$f":"COUNTIF('FMIS and OBD'!$J$3:$J$200,AN$3)","v":41},{"$f":"COUNTIF('FMIS and OBD'!$J$3:$J$200,AO$3)","v":125},null,{"$f":"SUM(AM4:AP4)","v":198},"J","Is there a dedicated PF publication web site?",null,{"$f":"AM4/$AQ4","v":0.16161616161616163},0.20707070707070707,0.63131313131313127,null,null,1,29,37,102,null,{"$f":"SUM(BA4:BD4)","v":168},null,{"$f":"BA4/$BE4","v":0.17261904761904762},0.22023809523809523,0.6071428571428571,null,null,"Afghanistan","AF",{"$f":"VLOOKUP($BL4,'FMIS and OBD'!$C$3:$EE$200,132,FALSE)","v":57.692307692307686},{"$f":"VLOOKUP($BL4,'FMIS and OBD'!$C$3:$DL$200,105,FALSE)","v":59},null,"Afghanistan",{"$f":"VLOOKUP($BQ4,'FMIS and OBD'!$C$3:$EE$200,132,FALSE)","v":57.692307692307686},{"$f":"VLOOKUP($BQ4,'FMIS and OBD'!$C$3:$DL$200,103,FALSE)","v":2.4},{"$f":"VLOOKUP($BQ4,'FMIS and OBD'!$C$3:$DL$200,104,FALSE)","v":2.370967741935484},null,null,null,null,null,null,null,"Afghanistan",{"$f":"VLOOKUP($CB4,'FMIS and OBD'!$C$3:$EE$200,132,FALSE)","v":57.692307692307686},{"$f":"VLOOKUP($CB4,'FMIS and OBD'!$C$3:$DL$200,103,FALSE)","v":2.4},{"$f":"VLOOKUP($CB4,'FMIS and OBD'!$C$3:$DL$200,104,FALSE)","v":2.370967741935484}]
[null,"UMIC",{"$f":"COUNTIFS('FMIS and OBD'!$EE$3:$EE$200,C$3,'FMIS and OBD'!$D$3:$D$200,$B5)","v":8},{"$f":"COUNTIFS('FMIS and OBD'!$EE$3:$EE$200,D$3,'FMIS and OBD'!$D$3:$D$200,$B5)","v":20},{"$f":"COUNTIFS('FMIS and OBD'!$EE$3:$EE$200,E$3,'FMIS and OBD'!$D$3:$D$200,$B5)","v":14},{"$f":"COUNTIFS('FMIS and OBD'!$EE$3:$EE$200,F$3,'FMIS and OBD'!$D$3:$D$200,$B5)","v":10},{"$f":"SUM(C5:F5)","v":52},null,"EAP",{"$f":"COUNTIFS('FMIS and OBD'!$EE$3:$EE$200,C$3,'FMIS and OBD'!$DL$3:$DL$200,$I5)","v":2},{"$f":"COUNTIFS('FMIS and OBD'!$EE$3:$EE$200,D$3,'FMIS and OBD'!$DL$3:$DL$200,$I5)","v":11},{"$f":"COUNTIFS('FMIS and OBD'!$EE$3:$EE$200,E$3,'FMIS and OBD'!$DL$3:$DL$200,$I5)","v":9},{"$f":"COUNTIFS('FMIS and OBD'!$EE$3:$EE$200,F$3,'FMIS and OBD'!$DL$3:$DL$200,$I5)","v":7},29,null,"A","Highly Visible",null,null,"UMIC",{"$f":"COUNTIFS(INDIRECT(\"'FMIS and OBD'!$\"&$Z$16&\"$3:$\"&$Z$16&\"$200\"),U$3,'FMIS and OBD'!$D$3:$D$200,$T5)","v":13},{"$f":"COUNTIFS(INDIRECT(\"'FMIS and OBD'!$\"&$Z$16&\"$3:$\"&$Z$16&\"$200\"),V$3,'FMIS and OBD'!$D$3:$D$200,$T5)","v":39},{"$f":"COUNTIFS(INDIRECT(\"'FMIS and OBD'!$\"&$Z$16&\"$3:$\"&$Z$16&\"$200\"),W$3,'FMIS and OBD'!$D$3:$D$200,$T5)","v":0},{"$f":"COUNTIFS(INDIRECT(\"'FMIS and OBD'!$\"&$Z$16&\"$3:$\"&$Z$16&\"$200\"),X$3,'FMIS and OBD'!$D$3:$D$200,$T5)","v":0},{"$f":"SUM(U5:X5)","v":52},null,"EAP",{"$f":"COUNTIFS(INDIRECT(\"'FMIS and OBD'!$\"&$Z$16&\"$3:$\"&$Z$16&\"$200\"),AB$3,'FMIS and OBD'!$DL$3:$DL$200,$AA5)","v":8},{"$f":"COUNTIFS(INDIRECT(\"'FMIS and OBD'!$\"&$Z$16&\"$3:$\"&$Z$16&\"$200\"),AC$3,'FMIS and OBD'!$DL$3:$DL$200,$AA5)","v":21},{"$f":"COUNTIFS(INDIRECT(\"'FMIS and OBD'!$\"&$Z$16&\"$3:$\"&$Z$16&\"$200\"),AD$3,'FMIS and OBD'!$DL$3:$DL$200,$AA5)","v":0},{"$f":"COUNTIFS(INDIRECT(\"'FMIS and OBD'!$\"&$Z$16&\"$3:$\"&$Z$16&\"$200\"),AE$3,'FMIS and OBD'!$DL$3:$DL$200,$AA5)","v":0},29,null,null,null,null,2,2,{"$f":"COUNTIF('FMIS and OBD'!$L$3:$L$200,AM$3)","v":23},{"$f":"COUNTIF('FMIS and OBD'!$L$3:$L$200,AN$3)","v":83},{"$f":"COUNTIF('FMIS and OBD'!$L$3:$L$200,AO$3)","v":92},null,198,"L","Is there a web page describing the FMIS platform / Data Warehouse?",null,0.11616161616161616,0.41919191919191917,0.46464646464646464,null,null,2,17,77,74,null,168,null,0.10119047619047619,0.45833333333333331,0.44047619047619047,null,null,"Albania","AL",{"$f":"VLOOKUP($BL5,'FMIS and OBD'!$C$3:$EE$200,132,FALSE)","v":61.53846153846154},{"$f":"VLOOKUP($BL5,'FMIS and OBD'!$C$3:$DL$200,105,FALSE)","v":47},null,"Albania",{"$f":"VLOOKUP($BQ5,'FMIS and OBD'!$C$3:$EE$200,132,FALSE)","v":61.53846153846154},{"$f":"VLOOKUP($BQ5,'FMIS and OBD'!$C$3:$DL$200,103,FALSE)","v":2.9},{"$f":"VLOOKUP($BQ5,'FMIS and OBD'!$C$3:$DL$200,104,FALSE)","v":2.9482758620689653},null,null,null,null,null,null,null,"Albania",{"$f":"VLOOKUP($CB5,'FMIS and OBD'!$C$3:$EE$200,132,FALSE)","v":61.53846153846154},{"$f":"VLOOKUP($CB5,'FMIS and OBD'!$C$3:$DL$200,103,FALSE)","v":2.9},{"$f":"VLOOKUP($CB5,'FMIS and OBD'!$C$3:$DL$200,104,FALSE)","v":2.9482758620689653}]
[null,"LMIC",{"$f":"COUNTIFS('FMIS and OBD'!$EE$3:$EE$200,C$3,'FMIS and OBD'!$D$3:$D$200,$B6)","v":5},{"$f":"COUNTIFS('FMIS and OBD'!$EE$3:$EE$200,D$3,'FMIS and OBD'!$D$3:$D$200,$B6)","v":19},{"$f":"COUNTIFS('FMIS and OBD'!$EE$3:$EE$200,E$3,'FMIS and OBD'!$D$3:$D$200,$B6)","v":18},{"$f":"COUNTIFS('FMIS and OBD'!$EE$3:$EE$200,F$3,'FMIS and OBD'!$D$3:$D$200,$B6)","v":12},{"$f":"SUM(C6:F6)","v":54},null,"ECA",{"$f":"COUNTIFS('FMIS and OBD'!$EE$3:$EE$200,C$3,'FMIS and OBD'!$DL$3:$DL$200,$I6)","v":3},{"$f":"COUNTIFS('FMIS and OBD'!$EE$3:$EE$200,D$3,'FMIS and OBD'!$DL$3:$DL$200,$I6)","v":18},{"$f":"COUNTIFS('FMIS and OBD'!$EE$3:$EE$200,E$3,'FMIS and OBD'!$DL$3:$DL$200,$I6)","v":6},{"$f":"COUNTIFS('FMIS and OBD'!$EE$3:$EE$200,F$3,'FMIS and OBD'!$DL$3:$DL$200,$I6)","v":3},30,null,"B","Visible",null,null,"LMIC",{"$f":"COUNTIFS(INDIRECT(\"'FMIS and OBD'!$\"&$Z$16&\"$3:$\"&$Z$16&\"$200\"),U$3,'FMIS and OBD'!$D$3:$D$200,$T6)","v":10},{"$f":"COUNTIFS(INDIRECT(\"'FMIS and OBD'!$\"&$Z$16&\"$3:$\"&$Z$16&\"$200\"),V$3,'FMIS and OBD'!$D$3:$D$200,$T6)","v":44},{"$f":"COUNTIFS(INDIRECT(\"'FMIS and OBD'!$\"&$Z$16&\"$3:$\"&$Z$16&\"$200\"),W$3,'FMIS and OBD'!$D$3:$D$200,$T6)","v":0},{"$f":"COUNTIFS(INDIRECT(\"'FMIS and OBD'!$\"&$Z$16&\"$3:$\"&$Z$16&\"$200\"),X$3,'FMIS and OBD'!$D$3:$D$200,$T6)","v":0},{"$f":"SUM(U6:X6)","v":54},null,"ECA",{"$f":"COUNTIFS(INDIRECT(\"'FMIS and OBD'!$\"&$Z$16&\"$3:$\"&$Z$16&\"$200\"),AB$3,'FMIS and OBD'!$DL$3:$DL$200,$AA6)","v":1},{"$f":"COUNTIFS(INDIRECT(\"'FMIS and OBD'!$\"&$Z$16&\"$3:$\"&$Z$16&\"$200\"),AC$3,'FMIS and OBD'!$DL$3:$DL$200,$AA6)","v":29},{"$f":"COUNTIFS(INDIRECT(\"'FMIS and OBD'!$\"&$Z$16&\"$3:$\"&$Z$16&\"$200\"),AD$3,'FMIS and OBD'!$DL$3:$DL$200,$AA6)","v":0},{"$f":"COUNTIFS(INDIRECT(\"'FMIS and OBD'!$\"&$Z$16&\"$3:$\"&$Z$16&\"$200\"),AE$3,'FMIS and OBD'!$DL$3:$DL$200,$AA6)","v":0},30,null,null,null,null,3,3,{"$f":"COUNTIF('FMIS and OBD'!$N$3:$N$200,AM$3)","v":32},{"$f":"COUNTIF('FMIS and OBD'!$N$3:$N$200,AN$3)","v":132},{"$f":"COUNTIF('FMIS and OBD'!$N$3:$N$200,AO$3)","v":22},{"$f":"COUNTIF('FMIS and OBD'!$N$3:$N$200,AP$3)","v":12},198,"N","Source of PF data",null,0.16161616161616163,0.66666666666666663,0.1111111111111111,{"$f":"AP6/$AQ6","v":6.0606060606060608E-2},null,3,29,114,17,8,168,null,0.17261904761904762,0.6785714285714286,0.10119047619047619,{"$f":"BD6/$BE6","v":4.7619047619047616E-2},null,"Algeria","DZ",{"$f":"VLOOKUP($BL6,'FMIS and OBD'!$C$3:$EE$200,132,FALSE)","v":34.615384615384613},{"$f":"VLOOKUP($BL6,'FMIS and OBD'!$C$3:$DL$200,105,FALSE)","v":13},null,"Algeria",{"$f":"VLOOKUP($BQ6,'FMIS and OBD'!$C$3:$EE$200,132,FALSE)","v":34.615384615384613},{"$f":"VLOOKUP($BQ6,'FMIS and OBD'!$C$3:$DL$200,103,FALSE)","v":2.3333333333333335},{"$f":"VLOOKUP($BQ6,'FMIS and OBD'!$C$3:$DL$200,104,FALSE)","v":2.6153846153846154},null,null,null,null,null,null,null,"Armenia",{"$f":"VLOOKUP($CB6,'FMIS and OBD'!$C$3:$EE$200,132,FALSE)","v":61.53846153846154},{"$f":"VLOOKUP($CB6,'FMIS and OBD'!$C$3:$DL$200,103,FALSE)","v":3.05},{"$f":"VLOOKUP($CB6,'FMIS and OBD'!$C$3:$DL$200,104,FALSE)","v":3.032258064516129}]
[null,"LIC",{"$f":"COUNTIFS('FMIS and OBD'!$EE$3:$EE$200,C$3,'FMIS and OBD'!$D$3:$D$200,$B7)","v":0},{"$f":"COUNTIFS('FMIS and OBD'!$EE$3:$EE$200,D$3,'FMIS and OBD'!$D$3:$D$200,$B7)","v":9},{"$f":"COUNTIFS('FMIS and OBD'!$EE$3:$EE$200,E$3,'FMIS and OBD'!$D$3:$D$200,$B7)","v":15},{"$f":"COUNTIFS('FMIS and OBD'!$EE$3:$EE$200,F$3,'FMIS and OBD'!$D$3:$D$200,$B7)","v":14},{"$f":"SUM(C7:F7)","v":38},null,"LCR",{"$f":"COUNTIFS('FMIS and OBD'!$EE$3:$EE$200,C$3,'FMIS and OBD'!$DL$3:$DL$200,$I7)","v":10},{"$f":"COUNTIFS('FMIS and OBD'!$EE$3:$EE$200,D$3,'FMIS and OBD'!$DL$3:$DL$200,$I7)","v":6},{"$f":"COUNTIFS('FMIS and OBD'!$EE$3:$EE$200,E$3,'FMIS and OBD'!$DL$3:$DL$200,$I7)","v":11},{"$f":"COUNTIFS('FMIS and OBD'!$EE$3:$EE$200,F$3,'FMIS and OBD'!$DL$3:$DL$200,$I7)","v":5},32,null,"C","Limited Visibility",null,null,"LIC",{"$f":"COUNTIFS(INDIRECT(\"'FMIS and OBD'!$\"&$Z$16&\"$3:$\"&$Z$16&\"$200\"),U$3,'FMIS and OBD'!$D$3:$D$200,$T7)","v":16},{"$f":"COUNTIFS(INDIRECT(\"'FMIS and OBD'!$\"&$Z$16&\"$3:$\"&$Z$16&\"$200\"),V$3,'FMIS and OBD'!$D$3:$D$200,$T7)","v":22},{"$f":"COUNTIFS(INDIRECT(\"'FMIS and OBD'!$\"&$Z$16&\"$3:$\"&$Z$16&\"$200\"),W$3,'FMIS and OBD'!$D$3:$D$200,$T7)","v":0},{"$f":"COUNTIFS(INDIRECT(\"'FMIS and OBD'!$\"&$Z$16&\"$3:$\"&$Z$16&\"$200\"),X$3,'FMIS and OBD'!$D$3:$D$200,$T7)","v":0},{"$f":"SUM(U7:X7)","v":38},null,"LCR",{"$f":"COUNTIFS(INDIRECT(\"'FMIS and OBD'!$\"&$Z$16&\"$3:$\"&$Z$16&\"$200\"),AB$3,'FMIS and OBD'!$DL$3:$DL$200,$AA7)","v":6},{"$f":"COUNTIFS(INDIRECT(\"'FMIS and OBD'!$\"&$Z$16&\"$3:$\"&$Z$16&\"$200\"),AC$3,'FMIS and OBD'!$DL$3:$DL$200,$AA7)","v":26},{"$f":"COUNTIFS(INDIRECT(\"'FMIS and OBD'!$\"&$Z$16&\"$3:$\"&$Z$16&\"$200\"),AD$3,'FMIS and OBD'!$DL$3:$DL$200,$AA7)","v":0},{"$f":"COUNTIFS(INDIRECT(\"'FMIS and OBD'!$\"&$Z$16&\"$3:$\"&$Z$16&\"$200\"),AE$3,'FMIS and OBD'!$DL$3:$DL$200,$AA7)","v":0},32,null,null,null,null,4,4,{"$f":"COUNTIF('FMIS and OBD'!$P$3:$P$200,AM$3)","v":146},{"$f":"COUNTIF('FMIS and OBD'!$P$3:$P$200,AN$3)","v":52},null,null,198,"P","Presence of Open Data (online, editable, free)",null,{"$f":"AM7/$AQ7","v":0.73737373737373735},{"$f":"AN7/$AQ7","v":0.26262626262626265},null,null,null,4,130,38,null,null,168,null,{"$f":"BA7/$BE7","v":0.77380952380952384},{"$f":"BB7/$BE7","v":0.22619047619047619},null,null,null,"Angola","AO",{"$f":"VLOOKUP($BL7,'FMIS and OBD'!$C$3:$EE$200,132,FALSE)","v":46.153846153846153},{"$f":"VLOOKUP($BL7,'FMIS and OBD'!$C$3:$DL$200,105,FALSE)","v":28},null,"Antigua and Barbuda",{"$f":"VLOOKUP($BQ7,'FMIS and OBD'!$C$3:$EE$200,132,FALSE)","v":38.461538461538467},{"$f":"VLOOKUP($BQ7,'FMIS and OBD'!$C$3:$DL$200,103,FALSE)","v":1.4},{"$f":"VLOOKUP($BQ7,'FMIS and OBD'!$C$3:$DL$200,104,FALSE)","v":1.5333333333333334},null,null,null,null,null,null,null,"Belarus",{"$f":"VLOOKUP($CB7,'FMIS and OBD'!$C$3:$EE$200,132,FALSE)","v":34.615384615384613},{"$f":"VLOOKUP($CB7,'FMIS and OBD'!$C$3:$DL$200,103,FALSE)","v":2.8888888888888888},{"$f":"VLOOKUP($CB7,'FMIS and OBD'!$C$3:$DL$200,104,FALSE)","v":3.0892857142857144}]
[null,"Sum",{"$f":"SUM(C4:C7)","v":24},{"$f":"SUM(D4:D7)","v":69},{"$f":"SUM(E4:E7)","v":61},{"$f":"SUM(F4:F7)","v":44},{"$f":"SUM(G4:G7)","v":198},null,"MNA",{"$f":"COUNTIFS('FMIS and OBD'!$EE$3:$EE$200,C$3,'FMIS and OBD'!$DL$3:$DL$200,$I8)","v":0},{"$f":"COUNTIFS('FMIS and OBD'!$EE$3:$EE$200,D$3,'FMIS and OBD'!$DL$3:$DL$200,$I8)","v":5},{"$f":"COUNTIFS('FMIS and OBD'!$EE$3:$EE$200,E$3,'FMIS and OBD'!$DL$3:$DL$200,$I8)","v":12},{"$f":"COUNTIFS('FMIS and OBD'!$EE$3:$EE$200,F$3,'FMIS and OBD'!$DL$3:$DL$200,$I8)","v":4},21,null,"D","Minimal Visibility",null,null,"Sum",{"$f":"SUM(U4:U7)","v":51},{"$f":"SUM(V4:V7)","v":147},{"$f":"SUM(W4:W7)","v":0},{"$f":"SUM(X4:X7)","v":0},{"$f":"SUM(Y4:Y7)","v":198},null,"MNA",{"$f":"COUNTIFS(INDIRECT(\"'FMIS and OBD'!$\"&$Z$16&\"$3:$\"&$Z$16&\"$200\"),AB$3,'FMIS and OBD'!$DL$3:$DL$200,$AA8)","v":8},{"$f":"COUNTIFS(INDIRECT(\"'FMIS and OBD'!$\"&$Z$16&\"$3:$\"&$Z$16&\"$200\"),AC$3,'FMIS and OBD'!$DL$3:$DL$200,$AA8)","v":13},{"$f":"COUNTIFS(INDIRECT(\"'FMIS and OBD'!$\"&$Z$16&\"$3:$\"&$Z$16&\"$200\"),AD$3,'FMIS and OBD'!$DL$3:$DL$200,$AA8)","v":0},{"$f":"COUNTIFS(INDIRECT(\"'FMIS and OBD'!$\"&$Z$16&\"$3:$\"&$Z$16&\"$200\"),AE$3,'FMIS and OBD'!$DL$3:$DL$200,$AA8)","v":0},21,null,null,null,null,5,5,{"$f":"COUNTIF('FMIS and OBD'!$R$3:$R$200,AM$3)","v":180},{"$f":"COUNTIF('FMIS and OBD'!$R$3:$R$200,AN$3)","v":18},null,null,198,"R","System Name visible in dynamic/static reports",null,0.90909090909090906,9.0909090909090912E-2,null,null,null,5,152,16,null,null,168,null,0.90476190476190477,9.5238095238095233E-2,null,null,null,"Argentina","AR",{"$f":"VLOOKUP($BL8,'FMIS and OBD'!$C$3:$EE$200,132,FALSE)","v":96.15384615384616},{"$f":"VLOOKUP($BL8,'FMIS and OBD'!$C$3:$DL$200,105,FALSE)","v":50},null,"Armenia",{"$f":"VLOOKUP($BQ8,'FMIS and OBD'!$C$3:$EE$200,132,FALSE)","v":61.53846153846154},{"$f":"VLOOKUP($BQ8,'FMIS and OBD'!$C$3:$DL$200,103,FALSE)","v":3.05},{"$f":"VLOOKUP($BQ8,'FMIS and OBD'!$C$3:$DL$200,104,FALSE)","v":3.032258064516129},null,null,null,null,null,null,null,"Benin",{"$f":"VLOOKUP($CB8,'FMIS and OBD'!$C$3:$EE$200,132,FALSE)","v":7.6923076923076925},{"$f":"VLOOKUP($CB8,'FMIS and OBD'!$C$3:$DL$200,103,FALSE)","v":1.85},{"$f":"VLOOKUP($CB8,'FMIS and OBD'!$C$3:$DL$200,104,FALSE)","v":1.967741935483871}]
[null,null,{"$f":"C8/$G$8","v":0.12121212121212122},{"$f":"D8/$G$8","v":0.34848484848484851},{"$f":"E8/$G$8","v":0.30808080808080807},{"$f":"F8/$G$8","v":0.22222222222222221},null,null,"SAR",{"$f":"COUNTIFS('FMIS and OBD'!$EE$3:$EE$200,C$3,'FMIS and OBD'!$DL$3:$DL$200,$I9)","v":1},{"$f":"COUNTIFS('FMIS and OBD'!$EE$3:$EE$200,D$3,'FMIS and OBD'!$DL$3:$DL$200,$I9)","v":6},{"$f":"COUNTIFS('FMIS and OBD'!$EE$3:$EE$200,E$3,'FMIS and OBD'!$DL$3:$DL$200,$I9)","v":1},{"$f":"COUNTIFS('FMIS and OBD'!$EE$3:$EE$200,F$3,'FMIS and OBD'!$DL$3:$DL$200,$I9)","v":0},8,null,null,null,null,null,null,{"$f":"U8/$Y$8","v":0.25757575757575757},{"$f":"V8/$Y$8","v":0.74242424242424243},{"$f":"W8/$Y$8","v":0},{"$f":"X8/$Y$8","v":0},null,null,"SAR",{"$f":"COUNTIFS(INDIRECT(\"'FMIS and OBD'!$\"&$Z$16&\"$3:$\"&$Z$16&\"$200\"),AB$3,'FMIS and OBD'!$DL$3:$DL$200,$AA9)","v":1},{"$f":"COUNTIFS(INDIRECT(\"'FMIS and OBD'!$\"&$Z$16&\"$3:$\"&$Z$16&\"$200\"),AC$3,'FMIS and OBD'!$DL$3:$DL$200,$AA9)","v":7},{"$f":"COUNTIFS(INDIRECT(\"'FMIS and OBD'!$\"&$Z$16&\"$3:$\"&$Z$16&\"$200\"),AD$3,'FMIS and OBD'!$DL$3:$DL$200,$AA9)","v":0},{"$f":"COUNTIFS(INDIRECT(\"'FMIS and OBD'!$\"&$Z$16&\"$3:$\"&$Z$16&\"$200\"),AE$3,'FMIS and OBD'!$DL$3:$DL$200,$AA9)","v":0},8,null,null,null,null,6,6,{"$f":"COUNTIF('FMIS and OBD'!$S$3:$S$200,AM$3)","v":170},{"$f":"COUNTIF('FMIS and OBD'!$S$3:$S$200,AN$3)","v":28},null,null,198,"S","System Time Stamp visible in dynamic/static reports",null,0.85858585858585856,0.14141414141414141,null,null,null,6,144,24,null,null,168,null,0.8571428571428571,0.14285714285714285,null,null,null,"Azerbaijan","AZ",{"$f":"VLOOKUP($BL9,'FMIS and OBD'!$C$3:$EE$200,132,FALSE)","v":34.615384615384613},{"$f":"VLOOKUP($BL9,'FMIS and OBD'!$C$3:$DL$200,105,FALSE)","v":42},null,"Azerbaijan",{"$f":"VLOOKUP($BQ9,'FMIS and OBD'!$C$3:$EE$200,132,FALSE)","v":34.615384615384613},{"$f":"VLOOKUP($BQ9,'FMIS and OBD'!$C$3:$DL$200,103,FALSE)","v":2.1},{"$f":"VLOOKUP($BQ9,'FMIS and OBD'!$C$3:$DL$200,104,FALSE)","v":2.6333333333333333},null,null,null,null,null,null,null,"Bhutan",{"$f":"VLOOKUP($CB9,'FMIS and OBD'!$C$3:$EE$200,132,FALSE)","v":53.846153846153847},{"$f":"VLOOKUP($CB9,'FMIS and OBD'!$C$3:$DL$200,103,FALSE)","v":2.95},{"$f":"VLOOKUP($CB9,'FMIS and OBD'!$C$3:$DL$200,104,FALSE)","v":2.9666666666666668}]
[null,null,null,null,null,null,null,null,"Sum",{"$f":"SUM(J4:J9)","v":16},{"$f":"SUM(K4:K9)","v":57},{"$f":"SUM(L4:L9)","v":57},{"$f":"SUM(M4:M9)","v":38},{"$f":"SUM(N4:N9)","v":168},null,null,null,null,null,null,null,null,null,null,null,null,"Sum",{"$f":"SUM(AB4:AB9)","v":44},{"$f":"SUM(AC4:AC9)","v":124},{"$f":"SUM(AD4:AD9)","v":0},{"$f":"SUM(AE4:AE9)","v":0},{"$f":"SUM(AF4:AF9)","v":168},null,null,null,null,7,7,{"$f":"COUNTIF('FMIS and OBD'!$U$3:$U$200,AM$3)","v":32},{"$f":"COUNTIF('FMIS and OBD'!$U$3:$U$200,AN$3)","v":97},{"$f":"COUNTIF('FMIS and OBD'!$U$3:$U$200,AO$3)","v":69},null,198,"U","Quality of information (level of detail visible at first sight)",null,0.16161616161616163,0.48989898989898989,{"$f":"AO10/$AQ10","v":0.34848484848484851},null,null,7,29,89,50,null,168,null,0.17261904761904762,0.52976190476190477,0.29761904761904762,null,null,"Bangladesh","BD",{"$f":"VLOOKUP($BL10,'FMIS and OBD'!$C$3:$EE$200,132,FALSE)","v":65.384615384615387},{"$f":"VLOOKUP($BL10,'FMIS and OBD'!$C$3:$DL$200,105,FALSE)","v":58},null,"Bahamas",{"$f":"VLOOKUP($BQ10,'FMIS and OBD'!$C$3:$EE$200,132,FALSE)","v":42.307692307692307},{"$f":"VLOOKUP($BQ10,'FMIS and OBD'!$C$3:$DL$200,103,FALSE)","v":1.9375},{"$f":"VLOOKUP($BQ10,'FMIS and OBD'!$C$3:$DL$200,104,FALSE)","v":1.8461538461538463},null,null,null,null,null,null,null,"Bolivia",{"$f":"VLOOKUP($CB10,'FMIS and OBD'!$C$3:$EE$200,132,FALSE)","v":73.076923076923066},{"$f":"VLOOKUP($CB10,'FMIS and OBD'!$C$3:$DL$200,103,FALSE)","v":2.25},{"$f":"VLOOKUP($CB10,'FMIS and OBD'!$C$3:$DL$200,104,FALSE)","v":2.5172413793103448}]
[null,"Other","A","B","C","D","Sum",null,null,{"$f":"J10/$N$10","v":9.5238095238095233E-2},{"$f":"K10/$N$10","v":0.3392857142857143},{"$f":"L10/$N$10","v":0.3392857142857143},{"$f":"M10/$N$10","v":0.22619047619047619},null,null,null,null,null,null,"Other",0,1,2,3,"Sum",null,null,{"$f":"AB10/$AF$10","v":0.26190476190476192},{"$f":"AC10/$AF$10","v":0.73809523809523814},{"$f":"AD10/$AF$10","v":0},{"$f":"AE10/$AF$10","v":0},null,null,null,null,null,8,8,{"$f":"COUNTIF('FMIS and OBD'!$V$3:$V$200,AM$3)","v":50},{"$f":"COUNTIF('FMIS and OBD'!$V$3:$V$200,AN$3)","v":148},null,null,198,"V","Content > Is there sufficient level of detail for users? ",null,0.25252525252525254,0.74747474747474751,null,null,null,8,45,123,null,null,168,null,0.26785714285714285,0.7321428571428571,null,null,null,"Benin","BJ",{"$f":"VLOOKUP($BL11,'FMIS and OBD'!$C$3:$EE$200,132,FALSE)","v":7.6923076923076925},{"$f":"VLOOKUP($BL11,'FMIS and OBD'!$C$3:$DL$200,105,FALSE)","v":1},null,"Bangladesh",{"$f":"VLOOKUP($BQ11,'FMIS and OBD'!$C$3:$EE$200,132,FALSE)","v":65.384615384615387},{"$f":"VLOOKUP($BQ11,'FMIS and OBD'!$C$3:$DL$200,103,FALSE)","v":2.4500000000000002},{"$f":"VLOOKUP($BQ11,'FMIS and OBD'!$C$3:$DL$200,104,FALSE)","v":2.1166666666666667},null,null,null,null,null,null,null,"Botswana",{"$f":"VLOOKUP($CB11,'FMIS and OBD'!$C$3:$EE$200,132,FALSE)","v":34.615384615384613},{"$f":"VLOOKUP($CB11,'FMIS and OBD'!$C$3:$DL$200,103,FALSE)","v":2.65},{"$f":"VLOOKUP($CB11,'FMIS and OBD'!$C$3:$DL$200,104,FALSE)","v":2.4516129032258065}]
[null,"EU",{"$f":"COUNTIFS('FMIS and OBD'!$EE$3:$EE$200,C$3,'FMIS and OBD'!$DM$3:$DM$200,$B12)","v":6},{"$f":"COUNTIFS('FMIS and OBD'!$EE$3:$EE$200,D$3,'FMIS and OBD'!$DM$3:$DM$200,$B12)","v":17},{"$f":"COUNTIFS('FMIS and OBD'!$EE$3:$EE$200,E$3,'FMIS and OBD'!$DM$3:$DM$200,$B12)","v":4},{"$f":"COUNTIFS('FMIS and OBD'!$EE$3:$EE$200,F$3,'FMIS and OBD'!$DM$3:$DM$200,$B12)","v":0},{"$f":"SUM(C12:F12)","v":27},null,null,null,null,null,null,null,null,null,null,null,null,"EU",{"$f":"COUNTIFS(INDIRECT(\"'FMIS and OBD'!$\"&$Z$16&\"$3:$\"&$Z$16&\"$200\"),U$3,'FMIS and OBD'!$DM$3:$DM$200,$T12)","v":2},{"$f":"COUNTIFS(INDIRECT(\"'FMIS and OBD'!$\"&$Z$16&\"$3:$\"&$Z$16&\"$200\"),V$3,'FMIS and OBD'!$DM$3:$DM$200,$T12)","v":25},{"$f":"COUNTIFS(INDIRECT(\"'FMIS and OBD'!$\"&$Z$16&\"$3:$\"&$Z$16&\"$200\"),W$3,'FMIS and OBD'!$DM$3:$DM$200,$T12)","v":0},{"$f":"COUNTIFS(INDIRECT(\"'FMIS and OBD'!$\"&$Z$16&\"$3:$\"&$Z$16&\"$200\"),X$3,'FMIS and OBD'!$DM$3:$DM$200,$T12)","v":0},{"$f":"SUM(U12:X12)","v":27},null,null,null,null,null,null,null,null,null,null,null,9,9,{"$f":"COUNTIF('FMIS and OBD'!$W$3:$W$200,AM$3)","v":149},{"$f":"COUNTIF('FMIS and OBD'!$W$3:$W$200,AN$3)","v":34},{"$f":"COUNTIF('FMIS and OBD'!$W$3:$W$200,AO$3)","v":15},null,198,"W","Citizen's Budget (CB) > Is there a web site for citizens presenting budget results in an easy to understand format?",null,0.75252525252525249,0.17171717171717171,{"$f":"AO12/$AQ12","v":7.575757575757576E-2},null,null,9,130,26,12,null,168,null,0.77380952380952384,0.15476190476190477,7.1428571428571425E-2,null,null,"Bolivia","BO",{"$f":"VLOOKUP($BL12,'FMIS and OBD'!$C$3:$EE$200,132,FALSE)","v":73.076923076923066},{"$f":"VLOOKUP($BL12,'FMIS and OBD'!$C$3:$DL$200,105,FALSE)","v":12},null,"Barbados",{"$f":"VLOOKUP($BQ12,'FMIS and OBD'!$C$3:$EE$200,132,FALSE)","v":19.230769230769234},{"$f":"VLOOKUP($BQ12,'FMIS and OBD'!$C$3:$DL$200,103,FALSE)","v":3.1666666666666665},{"$f":"VLOOKUP($BQ12,'FMIS and OBD'!$C$3:$DL$200,104,FALSE)","v":2.7884615384615383},null,null,null,null,null,null,null,"Brazil",{"$f":"VLOOKUP($CB12,'FMIS and OBD'!$C$3:$EE$200,132,FALSE)","v":100},{"$f":"VLOOKUP($CB12,'FMIS and OBD'!$C$3:$DL$200,103,FALSE)","v":3.5555555555555554},{"$f":"VLOOKUP($CB12,'FMIS and OBD'!$C$3:$DL$200,104,FALSE)","v":3.5178571428571428}]
[null,"OECD",{"$f":"COUNTIFS('FMIS and OBD'!$EE$3:$EE$200,C$3,'FMIS and OBD'!$DN$3:$DN$200,$B13)","v":12},{"$f":"COUNTIFS('FMIS and OBD'!$EE$3:$EE$200,D$3,'FMIS and OBD'!$DN$3:$DN$200,$B13)","v":18},{"$f":"COUNTIFS('FMIS and OBD'!$EE$3:$EE$200,E$3,'FMIS and OBD'!$DN$3:$DN$200,$B13)","v":4},{"$f":"COUNTIFS('FMIS and OBD'!$EE$3:$EE$200,F$3,'FMIS and OBD'!$DN$3:$DN$200,$B13)","v":0},{"$f":"SUM(C13:F13)","v":34},null,"Fragile","A","B","C","D","Sum",null,null,null,null,null,"OECD",{"$f":"COUNTIFS(INDIRECT(\"'FMIS and OBD'!$\"&$Z$16&\"$3:$\"&$Z$16&\"$200\"),U$3,'FMIS and OBD'!$DN$3:$DN$200,$T13)","v":3},{"$f":"COUNTIFS(INDIRECT(\"'FMIS and OBD'!$\"&$Z$16&\"$3:$\"&$Z$16&\"$200\"),V$3,'FMIS and OBD'!$DN$3:$DN$200,$T13)","v":31},{"$f":"COUNTIFS(INDIRECT(\"'FMIS and OBD'!$\"&$Z$16&\"$3:$\"&$Z$16&\"$200\"),W$3,'FMIS and OBD'!$DN$3:$DN$200,$T13)","v":0},{"$f":"COUNTIFS(INDIRECT(\"'FMIS and OBD'!$\"&$Z$16&\"$3:$\"&$Z$16&\"$200\"),X$3,'FMIS and OBD'!$DN$3:$DN$200,$T13)","v":0},{"$f":"SUM(U13:X13)","v":34},null,"Fragile",0,1,2,3,"Sum",null,null,null,null,10,10,{"$f":"COUNTIF('FMIS and OBD'!$Y$3:$Y$200,AM$3)","v":105},{"$f":"COUNTIF('FMIS and OBD'!$Y$3:$Y$200,AN$3)","v":93},null,null,198,"Y","BC/CoA published?  ",null,0.53030303030303028,0.46969696969696972,null,null,null,10,93,75,null,null,168,null,0.5535714285714286,0.44642857142857145,null,null,null,"Bosnia and Herzegovina","BA",{"$f":"VLOOKUP($BL13,'FMIS and OBD'!$C$3:$EE$200,132,FALSE)","v":50},{"$f":"VLOOKUP($BL13,'FMIS and OBD'!$C$3:$DL$200,105,FALSE)","v":50},null,"Belarus",{"$f":"VLOOKUP($BQ13,'FMIS and OBD'!$C$3:$EE$200,132,FALSE)","v":34.615384615384613},{"$f":"VLOOKUP($BQ13,'FMIS and OBD'!$C$3:$DL$200,103,FALSE)","v":2.8888888888888888},{"$f":"VLOOKUP($BQ13,'FMIS and OBD'!$C$3:$DL$200,104,FALSE)","v":3.0892857142857144},null,null,null,null,null,null,null,"Burkina Faso",{"$f":"VLOOKUP($CB13,'FMIS and OBD'!$C$3:$EE$200,132,FALSE)","v":42.307692307692307},{"$f":"VLOOKUP($CB13,'FMIS and OBD'!$C$3:$DL$200,103,FALSE)","v":2.85},{"$f":"VLOOKUP($CB13,'FMIS and OBD'!$C$3:$DL$200,104,FALSE)","v":2.7903225806451615}]
[null,"APEC",{"$f":"COUNTIFS('FMIS and OBD'!$EE$3:$EE$200,C$3,'FMIS and OBD'!$DO$3:$DO$200,$B14)","v":8},{"$f":"COUNTIFS('FMIS and OBD'!$EE$3:$EE$200,D$3,'FMIS and OBD'!$DO$3:$DO$200,$B14)","v":10},{"$f":"COUNTIFS('FMIS and OBD'!$EE$3:$EE$200,E$3,'FMIS and OBD'!$DO$3:$DO$200,$B14)","v":2},{"$f":"COUNTIFS('FMIS and OBD'!$EE$3:$EE$200,F$3,'FMIS and OBD'!$DO$3:$DO$200,$B14)","v":1},{"$f":"SUM(C14:F14)","v":21},null,"F",{"$f":"COUNTIFS('FMIS and OBD'!$EE$3:$EE$200,C$3,'FMIS and OBD'!$DP$3:$DP$200,$I14)","v":0},{"$f":"COUNTIFS('FMIS and OBD'!$EE$3:$EE$200,D$3,'FMIS and OBD'!$DP$3:$DP$200,$I14)","v":6},{"$f":"COUNTIFS('FMIS and OBD'!$EE$3:$EE$200,E$3,'FMIS and OBD'!$DP$3:$DP$200,$I14)","v":13},{"$f":"COUNTIFS('FMIS and OBD'!$EE$3:$EE$200,F$3,'FMIS and OBD'!$DP$3:$DP$200,$I14)","v":16},{"$f":"SUM(J14:M14)","v":35},null,null,null,null,null,"APEC",{"$f":"COUNTIFS(INDIRECT(\"'FMIS and OBD'!$\"&$Z$16&\"$3:$\"&$Z$16&\"$200\"),U$3,'FMIS and OBD'!$DO$3:$DO$200,$T14)","v":2},{"$f":"COUNTIFS(INDIRECT(\"'FMIS and OBD'!$\"&$Z$16&\"$3:$\"&$Z$16&\"$200\"),V$3,'FMIS and OBD'!$DO$3:$DO$200,$T14)","v":19},{"$f":"COUNTIFS(INDIRECT(\"'FMIS and OBD'!$\"&$Z$16&\"$3:$\"&$Z$16&\"$200\"),W$3,'FMIS and OBD'!$DO$3:$DO$200,$T14)","v":0},{"$f":"COUNTIFS(INDIRECT(\"'FMIS and OBD'!$\"&$Z$16&\"$3:$\"&$Z$16&\"$200\"),X$3,'FMIS and OBD'!$DO$3:$DO$200,$T14)","v":0},{"$f":"SUM(U14:X14)","v":21},null,"F",{"$f":"COUNTIFS(INDIRECT(\"'FMIS and OBD'!$\"&$Z$16&\"$3:$\"&$Z$16&\"$200\"),U$3,'FMIS and OBD'!$DP$3:$DP$200,$AA14)","v":16},{"$f":"COUNTIFS(INDIRECT(\"'FMIS and OBD'!$\"&$Z$16&\"$3:$\"&$Z$16&\"$200\"),V$3,'FMIS and OBD'!$DP$3:$DP$200,$AA14)","v":19},{"$f":"COUNTIFS(INDIRECT(\"'FMIS and OBD'!$\"&$Z$16&\"$3:$\"&$Z$16&\"$200\"),W$3,'FMIS and OBD'!$DP$3:$DP$200,$AA14)","v":0},{"$f":"COUNTIFS(INDIRECT(\"'FMIS and OBD'!$\"&$Z$16&\"$3:$\"&$Z$16&\"$200\"),X$3,'FMIS and OBD'!$DP$3:$DP$200,$AA14)","v":0},{"$f":"SUM(AB14:AE14)","v":35},null,null,null,null,11,11,{"$f":"COUNTIF('FMIS and OBD'!$AA$3:$AA$200,AM$3)","v":45},{"$f":"COUNTIF('FMIS and OBD'!$AA$3:$AA$200,AN$3)","v":153},null,null,198,"AA","Approved annual budget published?       ",null,0.22727272727272727,0.77272727272727271,null,null,null,11,40,128,null,null,168,null,0.23809523809523808,0.76190476190476186,null,null,null,"Botswana","BW",{"$f":"VLOOKUP($BL14,'FMIS and OBD'!$C$3:$EE$200,132,FALSE)","v":34.615384615384613},{"$f":"VLOOKUP($BL14,'FMIS and OBD'!$C$3:$DL$200,105,FALSE)","v":50},null,"Belize",{"$f":"VLOOKUP($BQ14,'FMIS and OBD'!$C$3:$EE$200,132,FALSE)","v":23.076923076923077},{"$f":"VLOOKUP($BQ14,'FMIS and OBD'!$C$3:$DL$200,103,FALSE)","v":1.55},{"$f":"VLOOKUP($BQ14,'FMIS and OBD'!$C$3:$DL$200,104,FALSE)","v":1.7741935483870968},null,null,null,null,null,null,null,"Cape Verde",{"$f":"VLOOKUP($CB14,'FMIS and OBD'!$C$3:$EE$200,132,FALSE)","v":57.692307692307686},{"$f":"VLOOKUP($CB14,'FMIS and OBD'!$C$3:$DL$200,103,FALSE)","v":2.35},{"$f":"VLOOKUP($CB14,'FMIS and OBD'!$C$3:$DL$200,104,FALSE)","v":2.661290322580645}]
[null,null,null,null,null,null,null,null,null,null,null,null,null,null,null,null,null,null,null,null,null,null,null,null,null,17,null,null,null,null,null,null,null,null,null,null,12,12,{"$f":"COUNTIF('FMIS and OBD'!$AB$3:$AB$200,AM$3)","v":33},{"$f":"COUNTIF('FMIS and OBD'!$AB$3:$AB$200,AN$3)","v":120},null,null,153,"AB","     If Yes > Regularity of publication",null,0.21568627450980393,0.78431372549019607,null,null,null,12,30,98,null,null,128,null,0.234375,0.765625,null,null,null,"Brazil","BR",{"$f":"VLOOKUP($BL15,'FMIS and OBD'!$C$3:$EE$200,132,FALSE)","v":100},{"$f":"VLOOKUP($BL15,'FMIS and OBD'!$C$3:$DL$200,105,FALSE)","v":73},null,"Benin",{"$f":"VLOOKUP($BQ15,'FMIS and OBD'!$C$3:$EE$200,132,FALSE)","v":7.6923076923076925},{"$f":"VLOOKUP($BQ15,'FMIS and OBD'!$C$3:$DL$200,103,FALSE)","v":1.85},{"$f":"VLOOKUP($BQ15,'FMIS and OBD'!$C$3:$DL$200,104,FALSE)","v":1.967741935483871},null,null,null,null,null,null,null,"Central African Republic",{"$f":"VLOOKUP($CB15,'FMIS and OBD'!$C$3:$EE$200,132,FALSE)","v":3.8461538461538463},{"$f":"VLOOKUP($CB15,'FMIS and OBD'!$C$3:$DL$200,103,FALSE)","v":1.55},{"$f":"VLOOKUP($CB15,'FMIS and OBD'!$C$3:$DL$200,104,FALSE)","v":1.6774193548387097}]
[null,null,null,null,null,null,null,null,null,null,null,null,null,null,null,null,null,null,"Indicator > ",null,null,null,null,null,null,{"$f":"VLOOKUP(Z15,AK4:AR42,8,FALSE)","v":"AK"},null,null,null,null,null,null,null,null,null,null,13,13,{"$f":"COUNTIF('FMIS and OBD'!$AD$3:$AD$200,AM$3)","v":95},{"$f":"COUNTIF('FMIS and OBD'!$AD$3:$AD$200,AN$3)","v":103},null,null,198,"AD","MTEF documents published?  ",null,0.47979797979797978,0.52020202020202022,null,null,null,13,87,81,null,null,168,null,0.5178571428571429,0.48214285714285715,null,null,null,"Bulgaria","BG",{"$f":"VLOOKUP($BL16,'FMIS and OBD'!$C$3:$EE$200,132,FALSE)","v":53.846153846153847},{"$f":"VLOOKUP($BL16,'FMIS and OBD'!$C$3:$DL$200,105,FALSE)","v":65},null,"Bhutan",{"$f":"VLOOKUP($BQ16,'FMIS and OBD'!$C$3:$EE$200,132,FALSE)","v":53.846153846153847},{"$f":"VLOOKUP($BQ16,'FMIS and OBD'!$C$3:$DL$200,103,FALSE)","v":2.95},{"$f":"VLOOKUP($BQ16,'FMIS and OBD'!$C$3:$DL$200,104,FALSE)","v":2.9666666666666668},null,null,null,null,null,null,null,"Colombia",{"$f":"VLOOKUP($CB16,'FMIS and OBD'!$C$3:$EE$200,132,FALSE)","v":92.307692307692307},{"$f":"VLOOKUP($CB16,'FMIS and OBD'!$C$3:$DL$200,103,FALSE)","v":3.125},{"$f":"VLOOKUP($CB16,'FMIS and OBD'!$C$3:$DL$200,104,FALSE)","v":2.9629629629629628}]
[null,null,null,null,null,null,null,null,null,null,null,null,null,null,null,null,null,null,null,null,"Indicator",{"$f":"VLOOKUP($Z$15,$AK$4:$AS$42,2,FALSE)","v":17},null,{"$f":"VLOOKUP($Z$15,$AK$4:$AS$42,9,FALSE)","v":"Budget execution results?    "},null,null,null,null,null,null,null,null,null,null,null,null,14,14,{"$f":"COUNTIF('FMIS and OBD'!$AE$3:$AE$200,AM$3)","v":39},{"$f":"COUNTIF('FMIS and OBD'!$AE$3:$AE$200,AN$3)","v":64},null,null,103,"AE","     If Yes > Regularity of publication",null,0.37864077669902912,0.62135922330097082,null,null,null,14,37,44,null,null,81,null,0.4567901234567901,0.54320987654320985,null,null,null,"Burkina Faso","BF",{"$f":"VLOOKUP($BL17,'FMIS and OBD'!$C$3:$EE$200,132,FALSE)","v":42.307692307692307},{"$f":"VLOOKUP($BL17,'FMIS and OBD'!$C$3:$DL$200,105,FALSE)","v":23},null,"Bolivia",{"$f":"VLOOKUP($BQ17,'FMIS and OBD'!$C$3:$EE$200,132,FALSE)","v":73.076923076923066},{"$f":"VLOOKUP($BQ17,'FMIS and OBD'!$C$3:$DL$200,103,FALSE)","v":2.25},{"$f":"VLOOKUP($BQ17,'FMIS and OBD'!$C$3:$DL$200,104,FALSE)","v":2.5172413793103448},null,null,null,null,null,null,null,"Congo",{"$f":"VLOOKUP($CB17,'FMIS and OBD'!$C$3:$EE$200,132,FALSE)","v":23.076923076923077},{"$f":"VLOOKUP($CB17,'FMIS and OBD'!$C$3:$DL$200,103,FALSE)","v":1.9},{"$f":"VLOOKUP($CB17,'FMIS and OBD'!$C$3:$DL$200,104,FALSE)","v":2}]
[null,null,null,null,null,null,null,null,null,null,null,null,null,null,null,null,null,null,null,null,null,null,null,null,null,null,null,null,null,null,null,null,null,null,null,null,15,15,{"$f":"COUNTIF('FMIS and OBD'!$AH$3:$AH$200,AM$3)","v":154},{"$f":"COUNTIF('FMIS and OBD'!$AH$3:$AH$200,AN$3)","v":44},null,null,198,"AH","Public investment plans?   ",null,0.77777777777777779,0.22222222222222221,null,null,null,15,130,38,null,null,168,null,0.77380952380952384,0.22619047619047619,null,null,null,"Cambodia","KH",{"$f":"VLOOKUP($BL18,'FMIS and OBD'!$C$3:$EE$200,132,FALSE)","v":34.615384615384613},{"$f":"VLOOKUP($BL18,'FMIS and OBD'!$C$3:$DL$200,105,FALSE)","v":15},null,"Botswana",{"$f":"VLOOKUP($BQ18,'FMIS and OBD'!$C$3:$EE$200,132,FALSE)","v":34.615384615384613},{"$f":"VLOOKUP($BQ18,'FMIS and OBD'!$C$3:$DL$200,103,FALSE)","v":2.65},{"$f":"VLOOKUP($BQ18,'FMIS and OBD'!$C$3:$DL$200,104,FALSE)","v":2.4516129032258065},null,null,null,null,null,null,null,"Congo, Dem. Rep.",{"$f":"VLOOKUP($CB18,'FMIS and OBD'!$C$3:$EE$200,132,FALSE)","v":3.8461538461538463},{"$f":"VLOOKUP($CB18,'FMIS and OBD'!$C$3:$DL$200,103,FALSE)","v":2},{"$f":"VLOOKUP($CB18,'FMIS and OBD'!$C$3:$DL$200,104,FALSE)","v":1.6}]
[null,"Current Practices",null,null,null,null,null,null,null,null,null,null,null,null,null,null,null,null,null,"# of points: 2",null,null,null,null,null,null,null,null,null,null,null,null,null,null,null,null,16,16,{"$f":"COUNTIF('FMIS and OBD'!$AI$3:$AI$200,AM$3)","v":12},{"$f":"COUNTIF('FMIS and OBD'!$AI$3:$AI$200,AN$3)","v":32},null,null,44,"AI","     If Yes > Regularity of publication",null,0.27272727272727271,0.72727272727272729,null,null,null,16,11,27,null,null,38,null,0.28947368421052633,0.71052631578947367,null,null,null,"Cameroon","CM",{"$f":"VLOOKUP($BL19,'FMIS and OBD'!$C$3:$EE$200,132,FALSE)","v":7.6923076923076925},{"$f":"VLOOKUP($BL19,'FMIS and OBD'!$C$3:$DL$200,105,FALSE)","v":10},null,"Brazil",{"$f":"VLOOKUP($BQ19,'FMIS and OBD'!$C$3:$EE$200,132,FALSE)","v":100},{"$f":"VLOOKUP($BQ19,'FMIS and OBD'!$C$3:$DL$200,103,FALSE)","v":3.5555555555555554},{"$f":"VLOOKUP($BQ19,'FMIS and OBD'!$C$3:$DL$200,104,FALSE)","v":3.5178571428571428},null,null,null,null,null,null,null,"Costa Rica",{"$f":"VLOOKUP($CB19,'FMIS and OBD'!$C$3:$EE$200,132,FALSE)","v":46.153846153846153},{"$f":"VLOOKUP($CB19,'FMIS and OBD'!$C$3:$DL$200,103,FALSE)","v":3.2},{"$f":"VLOOKUP($CB19,'FMIS and OBD'!$C$3:$DL$200,104,FALSE)","v":3.1774193548387095}]
[null,null,null,null,null,null,null,null,null,null,null,null,null,null,null,null,null,null,null,null,null,null,null,null,null,null,null,null,null,null,null,null,null,null,null,null,17,17,{"$f":"COUNTIF('FMIS and OBD'!$AK$3:$AK$200,AM$3)","v":51},{"$f":"COUNTIF('FMIS and OBD'!$AK$3:$AK$200,AN$3)","v":147},null,null,198,"AK","Budget execution results?    ",null,0.25757575757575757,0.74242424242424243,null,null,null,17,44,124,null,null,168,null,0.26190476190476192,0.73809523809523814,null,null,null,"Chad","TD",{"$f":"VLOOKUP($BL20,'FMIS and OBD'!$C$3:$EE$200,132,FALSE)","v":3.8461538461538463},{"$f":"VLOOKUP($BL20,'FMIS and OBD'!$C$3:$DL$200,105,FALSE)","v":3},null,"Burkina Faso",{"$f":"VLOOKUP($BQ20,'FMIS and OBD'!$C$3:$EE$200,132,FALSE)","v":42.307692307692307},{"$f":"VLOOKUP($BQ20,'FMIS and OBD'!$C$3:$DL$200,103,FALSE)","v":2.85},{"$f":"VLOOKUP($BQ20,'FMIS and OBD'!$C$3:$DL$200,104,FALSE)","v":2.7903225806451615},null,"           PEFA vs. FMIS & OBD Scores (121 economies)",null,null,null,null,null,"Côte d'Ivoire",{"$f":"VLOOKUP($CB20,'FMIS and OBD'!$C$3:$EE$200,132,FALSE)","v":46.153846153846153},{"$f":"VLOOKUP($CB20,'FMIS and OBD'!$C$3:$DL$200,103,FALSE)","v":1.8},{"$f":"VLOOKUP($CB20,'FMIS and OBD'!$C$3:$DL$200,104,FALSE)","v":1.7777777777777777}]
[null,null,null,null,null,null,null,null,null,null,null,null,null,null,null,null,null,null,null,null,null,null,null,null,null,null,null,null,null,null,null,null,null,null,null,null,18,18,{"$f":"COUNTIF('FMIS and OBD'!$AM$3:$AM$200,AM$3)","v":30},{"$f":"COUNTIF('FMIS and OBD'!$AM$3:$AM$200,AN$3)","v":117},null,null,147,"AM","     If Yes > Regularity of publication",null,0.20408163265306123,0.79591836734693877,null,null,null,18,28,96,null,null,124,null,0.22580645161290322,0.77419354838709675,null,null,null,"Chile","CL",{"$f":"VLOOKUP($BL21,'FMIS and OBD'!$C$3:$EE$200,132,FALSE)","v":65.384615384615387},{"$f":"VLOOKUP($BL21,'FMIS and OBD'!$C$3:$DL$200,105,FALSE)","v":66},null,"Burundi",{"$f":"VLOOKUP($BQ21,'FMIS and OBD'!$C$3:$EE$200,132,FALSE)","v":7.6923076923076925},{"$f":"VLOOKUP($BQ21,'FMIS and OBD'!$C$3:$DL$200,103,FALSE)","v":2.75},{"$f":"VLOOKUP($BQ21,'FMIS and OBD'!$C$3:$DL$200,104,FALSE)","v":2.4137931034482758},null,null,null,null,null,null,null,"Dominican Republic",{"$f":"VLOOKUP($CB21,'FMIS and OBD'!$C$3:$EE$200,132,FALSE)","v":65.384615384615387},{"$f":"VLOOKUP($CB21,'FMIS and OBD'!$C$3:$DL$200,103,FALSE)","v":2.8},{"$f":"VLOOKUP($CB21,'FMIS and OBD'!$C$3:$DL$200,104,FALSE)","v":2.4500000000000002}]
[null,null,null,null,null,null,null,null,null,null,null,null,null,null,null,null,null,null,null,null,null,null,null,null,null,null,null,null,null,null,null,null,null,null,null,null,19,19,{"$f":"COUNTIF('FMIS and OBD'!$AO$3:$AO$200,AM$3)","v":122},{"$f":"COUNTIF('FMIS and OBD'!$AO$3:$AO$200,AN$3)","v":76},null,null,198,"AO","External audit of central gov budget operations?    ",null,0.61616161616161613,0.38383838383838381,null,null,null,19,109,59,null,null,168,null,0.64880952380952384,0.35119047619047616,null,null,null,"China","CN",{"$f":"VLOOKUP($BL22,'FMIS and OBD'!$C$3:$EE$200,132,FALSE)","v":50},{"$f":"VLOOKUP($BL22,'FMIS and OBD'!$C$3:$DL$200,105,FALSE)","v":11},null,"Cambodia",{"$f":"VLOOKUP($BQ22,'FMIS and OBD'!$C$3:$EE$200,132,FALSE)","v":34.615384615384613},{"$f":"VLOOKUP($BQ22,'FMIS and OBD'!$C$3:$DL$200,103,FALSE)","v":2.0499999999999998},{"$f":"VLOOKUP($BQ22,'FMIS and OBD'!$C$3:$DL$200,104,FALSE)","v":2.1896551724137931},null,null,null,null,null,null,null,"El Salvador",{"$f":"VLOOKUP($CB22,'FMIS and OBD'!$C$3:$EE$200,132,FALSE)","v":84.615384615384613},{"$f":"VLOOKUP($CB22,'FMIS and OBD'!$C$3:$DL$200,103,FALSE)","v":2.9},{"$f":"VLOOKUP($CB22,'FMIS and OBD'!$C$3:$DL$200,104,FALSE)","v":2.967741935483871}]
[null,null,null,null,null,null,null,null,null,null,null,null,null,null,null,null,null,null,null,null,null,null,null,null,null,null,null,null,null,null,null,null,null,null,null,null,20,20,{"$f":"COUNTIF('FMIS and OBD'!$AP$3:$AP$200,AM$3)","v":15},{"$f":"COUNTIF('FMIS and OBD'!$AP$3:$AP$200,AN$3)","v":61},null,null,76,"AP","     If Yes > Regularity of publication",null,0.19736842105263158,0.80263157894736847,null,null,null,20,15,44,null,null,59,null,0.25423728813559321,0.74576271186440679,null,null,null,"Colombia","CO",{"$f":"VLOOKUP($BL23,'FMIS and OBD'!$C$3:$EE$200,132,FALSE)","v":92.307692307692307},{"$f":"VLOOKUP($BL23,'FMIS and OBD'!$C$3:$DL$200,105,FALSE)","v":58},null,"Cameroon",{"$f":"VLOOKUP($BQ23,'FMIS and OBD'!$C$3:$EE$200,132,FALSE)","v":7.6923076923076925},{"$f":"VLOOKUP($BQ23,'FMIS and OBD'!$C$3:$DL$200,103,FALSE)","v":1.9},{"$f":"VLOOKUP($BQ23,'FMIS and OBD'!$C$3:$DL$200,104,FALSE)","v":2},null,null,null,null,null,null,null,"Ethiopia",{"$f":"VLOOKUP($CB23,'FMIS and OBD'!$C$3:$EE$200,132,FALSE)","v":30.76923076923077},{"$f":"VLOOKUP($CB23,'FMIS and OBD'!$C$3:$DL$200,103,FALSE)","v":2.7777777777777777},{"$f":"VLOOKUP($CB23,'FMIS and OBD'!$C$3:$DL$200,104,FALSE)","v":2.8571428571428572}]
[null,null,null,null,null,null,null,null,null,null,null,null,null,null,null,null,null,null,null,null,null,null,null,null,null,null,null,null,null,null,null,null,null,null,null,null,21,21,{"$f":"COUNTIF('FMIS and OBD'!$AR$3:$AR$200,AM$3)","v":58},{"$f":"COUNTIF('FMIS and OBD'!$AR$3:$AR$200,AN$3)","v":140},null,null,198,"AR","Consolidated results for key budget users?  ",null,0.29292929292929293,0.70707070707070707,null,null,null,21,52,116,null,null,168,null,0.30952380952380953,0.69047619047619047,null,null,null,"Congo, Dem. Rep.","CD",{"$f":"VLOOKUP($BL24,'FMIS and OBD'!$C$3:$EE$200,132,FALSE)","v":3.8461538461538463},{"$f":"VLOOKUP($BL24,'FMIS and OBD'!$C$3:$DL$200,105,FALSE)","v":18},null,"Cape Verde",{"$f":"VLOOKUP($BQ24,'FMIS and OBD'!$C$3:$EE$200,132,FALSE)","v":57.692307692307686},{"$f":"VLOOKUP($BQ24,'FMIS and OBD'!$C$3:$DL$200,103,FALSE)","v":2.35},{"$f":"VLOOKUP($BQ24,'FMIS and OBD'!$C$3:$DL$200,104,FALSE)","v":2.661290322580645},null,null,null,null,null,null,null,"Gabon",{"$f":"VLOOKUP($CB24,'FMIS and OBD'!$C$3:$EE$200,132,FALSE)","v":50},{"$f":"VLOOKUP($CB24,'FMIS and OBD'!$C$3:$DL$200,103,FALSE)","v":1.875},{"$f":"VLOOKUP($CB24,'FMIS and OBD'!$C$3:$DL$200,104,FALSE)","v":1.9565217391304348}]
[null,null,null,null,null,null,null,null,null,null,null,null,null,null,null,null,null,null,null,null,null,null,null,null,null,null,null,null,null,null,null,null,null,null,null,null,22,22,{"$f":"COUNTIF('FMIS and OBD'!$AS$3:$AS$200,AM$3)","v":53},{"$f":"COUNTIF('FMIS and OBD'!$AS$3:$AS$200,AN$3)","v":145},null,null,198,"AS","Sector analysis?",null,0.26767676767676768,0.73232323232323238,null,null,null,22,49,119,null,null,168,null,0.29166666666666669,0.70833333333333337,null,null,null,"Costa Rica","CR",{"$f":"VLOOKUP($BL25,'FMIS and OBD'!$C$3:$EE$200,132,FALSE)","v":46.153846153846153},{"$f":"VLOOKUP($BL25,'FMIS and OBD'!$C$3:$DL$200,105,FALSE)","v":50},null,"Central African Republic",{"$f":"VLOOKUP($BQ25,'FMIS and OBD'!$C$3:$EE$200,132,FALSE)","v":3.8461538461538463},{"$f":"VLOOKUP($BQ25,'FMIS and OBD'!$C$3:$DL$200,103,FALSE)","v":1.55},{"$f":"VLOOKUP($BQ25,'FMIS and OBD'!$C$3:$DL$200,104,FALSE)","v":1.6774193548387097},null,null,null,null,null,null,null,"Georgia",{"$f":"VLOOKUP($CB25,'FMIS and OBD'!$C$3:$EE$200,132,FALSE)","v":73.076923076923066},{"$f":"VLOOKUP($CB25,'FMIS and OBD'!$C$3:$DL$200,103,FALSE)","v":2.6},{"$f":"VLOOKUP($CB25,'FMIS and OBD'!$C$3:$DL$200,104,FALSE)","v":2.6333333333333333}]
[null,null,null,null,null,null,null,null,null,null,null,null,null,null,null,null,null,null,null,null,null,null,null,null,null,null,null,null,null,null,null,null,null,null,null,null,23,23,{"$f":"COUNTIF('FMIS and OBD'!$AT$3:$AT$200,AM$3)","v":138},{"$f":"COUNTIF('FMIS and OBD'!$AT$3:$AT$200,AN$3)","v":58},null,null,196,"AT","Regional analysis?  ",null,{"$f":"AM26/198","v":0.69696969696969702},{"$f":"AN26/198","v":0.29292929292929293},null,{"$f":"(198-AQ26)/198","v":1.0101010101010102E-2},null,23,119,47,null,null,166,null,{"$f":"BA26/168","v":0.70833333333333337},{"$f":"BB26/168","v":0.27976190476190477},null,{"$f":"(168-BE26)/168","v":1.1904761904761904E-2},null,"Croatia","HR",{"$f":"VLOOKUP($BL26,'FMIS and OBD'!$C$3:$EE$200,132,FALSE)","v":53.846153846153847},{"$f":"VLOOKUP($BL26,'FMIS and OBD'!$C$3:$DL$200,105,FALSE)","v":61},null,"Chad",{"$f":"VLOOKUP($BQ26,'FMIS and OBD'!$C$3:$EE$200,132,FALSE)","v":3.8461538461538463},{"$f":"VLOOKUP($BQ26,'FMIS and OBD'!$C$3:$DL$200,103,FALSE)","v":1.95},{"$f":"VLOOKUP($BQ26,'FMIS and OBD'!$C$3:$DL$200,104,FALSE)","v":1.9166666666666667},null,null,null,null,null,null,null,"Ghana",{"$f":"VLOOKUP($CB26,'FMIS and OBD'!$C$3:$EE$200,132,FALSE)","v":61.53846153846154},{"$f":"VLOOKUP($CB26,'FMIS and OBD'!$C$3:$DL$200,103,FALSE)","v":2.65},{"$f":"VLOOKUP($CB26,'FMIS and OBD'!$C$3:$DL$200,104,FALSE)","v":2.4166666666666665}]
[null,null,null,null,null,null,null,null,null,null,null,null,null,null,null,null,null,null,null,null,null,null,null,null,null,null,null,null,null,null,null,null,null,null,null,null,24,24,{"$f":"COUNTIF('FMIS and OBD'!$AU$3:$AU$200,AM$3)","v":168},{"$f":"COUNTIF('FMIS and OBD'!$AU$3:$AU$200,AN$3)","v":30},null,null,198,"AU","Gender analysis?",null,0.84848484848484851,0.15151515151515152,null,null,null,24,146,22,null,null,168,null,0.86904761904761907,0.13095238095238096,null,null,null,"Czech Republic","CS",{"$f":"VLOOKUP($BL27,'FMIS and OBD'!$C$3:$EE$200,132,FALSE)","v":50},{"$f":"VLOOKUP($BL27,'FMIS and OBD'!$C$3:$DL$200,105,FALSE)","v":75},null,"Colombia",{"$f":"VLOOKUP($BQ27,'FMIS and OBD'!$C$3:$EE$200,132,FALSE)","v":92.307692307692307},{"$f":"VLOOKUP($BQ27,'FMIS and OBD'!$C$3:$DL$200,103,FALSE)","v":3.125},{"$f":"VLOOKUP($BQ27,'FMIS and OBD'!$C$3:$DL$200,104,FALSE)","v":2.9629629629629628},null,null,null,null,null,null,null,"Grenada",{"$f":"VLOOKUP($CB27,'FMIS and OBD'!$C$3:$EE$200,132,FALSE)","v":34.615384615384613},{"$f":"VLOOKUP($CB27,'FMIS and OBD'!$C$3:$DL$200,103,FALSE)","v":2.4500000000000002},{"$f":"VLOOKUP($CB27,'FMIS and OBD'!$C$3:$DL$200,104,FALSE)","v":2.2166666666666668}]
[null,null,null,null,null,null,null,null,null,null,null,null,null,null,null,null,null,null,null,null,null,null,null,null,null,null,null,null,null,null,null,null,null,null,null,null,25,25,{"$f":"COUNTIF('FMIS and OBD'!$AV$3:$AV$200,AM$3)","v":174},{"$f":"COUNTIF('FMIS and OBD'!$AV$3:$AV$200,AN$3)","v":24},null,null,198,"AV","Analysis of spending for Children?",null,0.87878787878787878,0.12121212121212122,null,null,null,25,149,19,null,null,168,null,0.88690476190476186,0.1130952380952381,null,null,null,"Dominican Republic","DO",{"$f":"VLOOKUP($BL28,'FMIS and OBD'!$C$3:$EE$200,132,FALSE)","v":65.384615384615387},{"$f":"VLOOKUP($BL28,'FMIS and OBD'!$C$3:$DL$200,105,FALSE)","v":29},null,"Comoros",{"$f":"VLOOKUP($BQ28,'FMIS and OBD'!$C$3:$EE$200,132,FALSE)","v":3.8461538461538463},{"$f":"VLOOKUP($BQ28,'FMIS and OBD'!$C$3:$DL$200,103,FALSE)","v":1.4},{"$f":"VLOOKUP($BQ28,'FMIS and OBD'!$C$3:$DL$200,104,FALSE)","v":1.4516129032258065},null,null,null,null,null,null,null,"Guatemala",{"$f":"VLOOKUP($CB28,'FMIS and OBD'!$C$3:$EE$200,132,FALSE)","v":76.923076923076934},{"$f":"VLOOKUP($CB28,'FMIS and OBD'!$C$3:$DL$200,103,FALSE)","v":2.5499999999999998},{"$f":"VLOOKUP($CB28,'FMIS and OBD'!$C$3:$DL$200,104,FALSE)","v":2.4655172413793105}]
[null,null,null,null,null,null,null,null,null,null,null,null,null,null,null,null,null,null,null,"# of points: 3",null,null,null,null,null,null,null,null,null,null,null,null,null,null,null,null,26,26,{"$f":"COUNTIF('FMIS and OBD'!$AW$3:$AW$200,AM$3)","v":53},{"$f":"COUNTIF('FMIS and OBD'!$AW$3:$AW$200,AN$3)","v":145},null,null,198,"AW","Debt data?",null,0.26767676767676768,0.73232323232323238,null,null,null,26,48,120,null,null,168,null,0.2857142857142857,0.7142857142857143,null,null,null,"Ecuador","EC",{"$f":"VLOOKUP($BL29,'FMIS and OBD'!$C$3:$EE$200,132,FALSE)","v":80.769230769230774},{"$f":"VLOOKUP($BL29,'FMIS and OBD'!$C$3:$DL$200,105,FALSE)","v":31},null,"Congo",{"$f":"VLOOKUP($BQ29,'FMIS and OBD'!$C$3:$EE$200,132,FALSE)","v":23.076923076923077},{"$f":"VLOOKUP($BQ29,'FMIS and OBD'!$C$3:$DL$200,103,FALSE)","v":1.9},{"$f":"VLOOKUP($BQ29,'FMIS and OBD'!$C$3:$DL$200,104,FALSE)","v":2},null,null,null,null,null,null,null,"Guinea-Bissau",{"$f":"VLOOKUP($CB29,'FMIS and OBD'!$C$3:$EE$200,132,FALSE)","v":42.307692307692307},{"$f":"VLOOKUP($CB29,'FMIS and OBD'!$C$3:$DL$200,103,FALSE)","v":1.3333333333333333},{"$f":"VLOOKUP($CB29,'FMIS and OBD'!$C$3:$DL$200,104,FALSE)","v":1.2777777777777777}]
[null,null,null,null,null,null,null,null,null,null,null,null,null,null,null,null,null,null,null,null,null,null,null,null,null,null,null,null,null,null,null,null,null,null,null,null,27,27,{"$f":"COUNTIF('FMIS and OBD'!$AX$3:$AX$200,AM$3)","v":73},{"$f":"COUNTIF('FMIS and OBD'!$AX$3:$AX$200,AN$3)","v":123},null,null,196,"AX","Foreign aid/grants? ",null,{"$f":"AM30/198","v":0.36868686868686867},{"$f":"AN30/198","v":0.62121212121212122},null,{"$f":"(198-AQ30)/198","v":1.0101010101010102E-2},null,27,62,105,null,null,167,null,{"$f":"BA30/168","v":0.36904761904761907},{"$f":"BB30/168","v":0.625},null,{"$f":"(168-BE30)/168","v":5.9523809523809521E-3},null,"Egypt","EG",{"$f":"VLOOKUP($BL30,'FMIS and OBD'!$C$3:$EE$200,132,FALSE)","v":38.461538461538467},{"$f":"VLOOKUP($BL30,'FMIS and OBD'!$C$3:$DL$200,105,FALSE)","v":13},null,"Congo, Dem. Rep.",{"$f":"VLOOKUP($BQ30,'FMIS and OBD'!$C$3:$EE$200,132,FALSE)","v":3.8461538461538463},{"$f":"VLOOKUP($BQ30,'FMIS and OBD'!$C$3:$DL$200,103,FALSE)","v":2},{"$f":"VLOOKUP($BQ30,'FMIS and OBD'!$C$3:$DL$200,104,FALSE)","v":1.6},null,null,null,null,null,null,null,"India",{"$f":"VLOOKUP($CB30,'FMIS and OBD'!$C$3:$EE$200,132,FALSE)","v":80.769230769230774},{"$f":"VLOOKUP($CB30,'FMIS and OBD'!$C$3:$DL$200,103,FALSE)","v":2.9444444444444446},{"$f":"VLOOKUP($CB30,'FMIS and OBD'!$C$3:$DL$200,104,FALSE)","v":2.75}]
[null,"Open Budget Index Scores vs. FMIS & BT Grades",null,null,null,null,null,null,null,null,null,null,null,null,null,null,null,null,null,null,null,null,null,null,null,null,null,null,null,null,null,null,null,null,null,null,28,28,{"$f":"COUNTIF('FMIS and OBD'!$AY$3:$AY$200,AM$3)","v":121},{"$f":"COUNTIF('FMIS and OBD'!$AY$3:$AY$200,AN$3)","v":75},null,null,196,"AY","Fiscal data on sub-national gov/municipalities?",null,{"$f":"AM31/198","v":0.61111111111111116},{"$f":"AN31/198","v":0.37878787878787878},null,{"$f":"(198-AQ31)/198","v":1.0101010101010102E-2},null,28,107,59,null,null,166,null,{"$f":"BA31/168","v":0.63690476190476186},{"$f":"BB31/168","v":0.35119047619047616},null,{"$f":"(168-BE31)/168","v":1.1904761904761904E-2},null,"El Salvador","SV",{"$f":"VLOOKUP($BL31,'FMIS and OBD'!$C$3:$EE$200,132,FALSE)","v":84.615384615384613},{"$f":"VLOOKUP($BL31,'FMIS and OBD'!$C$3:$DL$200,105,FALSE)","v":43},null,"Costa Rica",{"$f":"VLOOKUP($BQ31,'FMIS and OBD'!$C$3:$EE$200,132,FALSE)","v":46.153846153846153},{"$f":"VLOOKUP($BQ31,'FMIS and OBD'!$C$3:$DL$200,103,FALSE)","v":3.2},{"$f":"VLOOKUP($BQ31,'FMIS and OBD'!$C$3:$DL$200,104,FALSE)","v":3.1774193548387095},null,null,null,null,null,null,null,"Jamaica",{"$f":"VLOOKUP($CB31,'FMIS and OBD'!$C$3:$EE$200,132,FALSE)","v":34.615384615384613},{"$f":"VLOOKUP($CB31,'FMIS and OBD'!$C$3:$DL$200,103,FALSE)","v":2.35},{"$f":"VLOOKUP($CB31,'FMIS and OBD'!$C$3:$DL$200,104,FALSE)","v":2.4333333333333331}]
[null,"OBI2012","A","B","C","D","Sum",null,"0 - 20       Scant or no information",null,null,null,null,null,null,null,null,null,null,null,null,null,null,null,null,null,null,null,null,null,null,null,null,null,null,null,29,29,{"$f":"COUNTIF('FMIS and OBD'!$AZ$3:$AZ$200,AM$3)","v":92},{"$f":"COUNTIF('FMIS and OBD'!$AZ$3:$AZ$200,AN$3)","v":106},null,null,198,"AZ","Financial Statements?",null,0.46464646464646464,0.53535353535353536,null,null,null,29,83,85,null,null,168,null,0.49404761904761907,0.50595238095238093,null,null,null,"Equatorial Guinea","GQ",{"$f":"VLOOKUP($BL32,'FMIS and OBD'!$C$3:$EE$200,132,FALSE)","v":0},{"$f":"VLOOKUP($BL32,'FMIS and OBD'!$C$3:$DL$200,105,FALSE)","v":0},null,"Côte d'Ivoire",{"$f":"VLOOKUP($BQ32,'FMIS and OBD'!$C$3:$EE$200,132,FALSE)","v":46.153846153846153},{"$f":"VLOOKUP($BQ32,'FMIS and OBD'!$C$3:$DL$200,103,FALSE)","v":1.8},{"$f":"VLOOKUP($BQ32,'FMIS and OBD'!$C$3:$DL$200,104,FALSE)","v":1.7777777777777777},null,null,null,null,null,null,null,"Kenya",{"$f":"VLOOKUP($CB32,'FMIS and OBD'!$C$3:$EE$200,132,FALSE)","v":50},{"$f":"VLOOKUP($CB32,'FMIS and OBD'!$C$3:$DL$200,103,FALSE)","v":2.2000000000000002},{"$f":"VLOOKUP($CB32,'FMIS and OBD'!$C$3:$DL$200,104,FALSE)","v":2.3548387096774195}]
[null,"0 - 20",1,4,13,8,{"$f":"SUM(C33:F33)","v":26},null,"21 - 40     Minimal",null,null,null,null,null,null,null,null,null,null,null,null,null,null,null,null,null,null,null,null,null,null,null,null,null,null,null,30,30,{"$f":"COUNTIF('FMIS and OBD'!$BA$3:$BA$200,AM$3)","v":145},{"$f":"COUNTIF('FMIS and OBD'!$BA$3:$BA$200,AN$3)","v":53},null,null,198,"BA","Public procurement and contracts?",null,0.73232323232323238,0.26767676767676768,null,null,null,30,127,41,null,null,168,null,0.75595238095238093,0.24404761904761904,null,null,null,"Fiji","FJ",{"$f":"VLOOKUP($BL33,'FMIS and OBD'!$C$3:$EE$200,132,FALSE)","v":42.307692307692307},{"$f":"VLOOKUP($BL33,'FMIS and OBD'!$C$3:$DL$200,105,FALSE)","v":6},null,"Dominica",{"$f":"VLOOKUP($BQ33,'FMIS and OBD'!$C$3:$EE$200,132,FALSE)","v":46.153846153846153},{"$f":"VLOOKUP($BQ33,'FMIS and OBD'!$C$3:$DL$200,103,FALSE)","v":2.5499999999999998},{"$f":"VLOOKUP($BQ33,'FMIS and OBD'!$C$3:$DL$200,104,FALSE)","v":2.5161290322580645},null,null,null,null,null,null,null,"Kosovo",{"$f":"VLOOKUP($CB33,'FMIS and OBD'!$C$3:$EE$200,132,FALSE)","v":38.461538461538467},{"$f":"VLOOKUP($CB33,'FMIS and OBD'!$C$3:$DL$200,103,FALSE)","v":2.8},{"$f":"VLOOKUP($CB33,'FMIS and OBD'!$C$3:$DL$200,104,FALSE)","v":2.774193548387097}]
[null,"21 - 40",1,12,1,1,{"$f":"SUM(C34:F34)","v":15},null,"41 - 60     Some",null,null,null,null,null,null,null,null,null,null,null,null,null,null,null,null,null,null,null,null,null,null,null,null,null,null,null,31,31,{"$f":"COUNTIF('FMIS and OBD'!$BD$3:$BD$200,AM$3)","v":137},{"$f":"COUNTIF('FMIS and OBD'!$BD$3:$BD$200,AN$3)","v":61},null,null,198,"BD","Open Government/Open Budget web site? ",null,0.69191919191919193,0.30808080808080807,null,null,null,31,127,41,null,null,168,null,0.75595238095238093,0.24404761904761904,null,null,null,"France","FR",{"$f":"VLOOKUP($BL34,'FMIS and OBD'!$C$3:$EE$200,132,FALSE)","v":69.230769230769226},{"$f":"VLOOKUP($BL34,'FMIS and OBD'!$C$3:$DL$200,105,FALSE)","v":83},null,"Dominican Republic",{"$f":"VLOOKUP($BQ34,'FMIS and OBD'!$C$3:$EE$200,132,FALSE)","v":65.384615384615387},{"$f":"VLOOKUP($BQ34,'FMIS and OBD'!$C$3:$DL$200,103,FALSE)","v":2.8},{"$f":"VLOOKUP($BQ34,'FMIS and OBD'!$C$3:$DL$200,104,FALSE)","v":2.4500000000000002},null,null,null,null,null,null,null,"Kyrgyz Republic",{"$f":"VLOOKUP($CB34,'FMIS and OBD'!$C$3:$EE$200,132,FALSE)","v":61.53846153846154},{"$f":"VLOOKUP($CB34,'FMIS and OBD'!$C$3:$DL$200,103,FALSE)","v":2.25},{"$f":"VLOOKUP($CB34,'FMIS and OBD'!$C$3:$DL$200,104,FALSE)","v":2.0499999999999998}]
[null,"41 - 60",7,23,5,1,{"$f":"SUM(C35:F35)","v":36},null,"61 - 80     Significant",null,null,null,null,null,null,null,null,null,null,null,null,null,null,null,null,null,null,null,null,null,null,null,null,null,null,null,32,32,{"$f":"COUNTIF('FMIS and OBD'!$BF$3:$BF$200,AM$3)","v":170},{"$f":"COUNTIF('FMIS and OBD'!$BF$3:$BF$200,AN$3)","v":10},{"$f":"COUNTIF('FMIS and OBD'!$BF$3:$BF$200,AO$3)","v":16},null,196,"BF","Does FMIS support the PFM needs of state/local governments or municipalities?",null,{"$f":"AM35/198","v":0.85858585858585856},{"$f":"AN35/198","v":5.0505050505050504E-2},{"$f":"AO35/198","v":8.0808080808080815E-2},{"$f":"(198-AQ35)/198","v":1.0101010101010102E-2},null,32,141,10,15,null,166,null,{"$f":"BA35/168","v":0.8392857142857143},{"$f":"BB35/168","v":5.9523809523809521E-2},{"$f":"BC35/168","v":8.9285714285714288E-2},{"$f":"(168-BE35)/168","v":1.1904761904761904E-2},null,"Georgia","GE",{"$f":"VLOOKUP($BL35,'FMIS and OBD'!$C$3:$EE$200,132,FALSE)","v":73.076923076923066},{"$f":"VLOOKUP($BL35,'FMIS and OBD'!$C$3:$DL$200,105,FALSE)","v":55},null,"Ecuador",{"$f":"VLOOKUP($BQ35,'FMIS and OBD'!$C$3:$EE$200,132,FALSE)","v":80.769230769230774},{"$f":"VLOOKUP($BQ35,'FMIS and OBD'!$C$3:$DL$200,103,FALSE)","v":1.9},{"$f":"VLOOKUP($BQ35,'FMIS and OBD'!$C$3:$DL$200,104,FALSE)","v":2.370967741935484},null,null,null,null,null,null,null,"Lao PDR",{"$f":"VLOOKUP($CB35,'FMIS and OBD'!$C$3:$EE$200,132,FALSE)","v":26.923076923076923},{"$f":"VLOOKUP($CB35,'FMIS and OBD'!$C$3:$DL$200,103,FALSE)","v":1.95},{"$f":"VLOOKUP($CB35,'FMIS and OBD'!$C$3:$DL$200,104,FALSE)","v":2}]
[null,"61 - 80",10,7,null,null,{"$f":"SUM(C36:F36)","v":17},null,"81 - 100   Extensive information",null,null,null,null,null,null,null,null,null,null,null,null,null,null,null,null,null,null,null,null,null,null,null,null,null,null,null,33,33,{"$f":"COUNTIF('FMIS and OBD'!$BH$3:$BH$200,AM$3)","v":131},{"$f":"COUNTIF('FMIS and OBD'!$BH$3:$BH$200,AN$3)","v":65},null,null,196,"BH","Is there a harmonized public accounting system for central + state/local governments and municipalities?",null,{"$f":"AM36/198","v":0.66161616161616166},{"$f":"AN36/198","v":0.32828282828282829},null,{"$f":"(198-AQ36)/198","v":1.0101010101010102E-2},null,33,111,55,null,null,166,null,{"$f":"BA36/168","v":0.6607142857142857},{"$f":"BB36/168","v":0.32738095238095238},null,{"$f":"(168-BE36)/168","v":1.1904761904761904E-2},null,"Germany","DE",{"$f":"VLOOKUP($BL36,'FMIS and OBD'!$C$3:$EE$200,132,FALSE)","v":80.769230769230774},{"$f":"VLOOKUP($BL36,'FMIS and OBD'!$C$3:$DL$200,105,FALSE)","v":71},null,"Egypt",{"$f":"VLOOKUP($BQ36,'FMIS and OBD'!$C$3:$EE$200,132,FALSE)","v":38.461538461538467},{"$f":"VLOOKUP($BQ36,'FMIS and OBD'!$C$3:$DL$200,103,FALSE)","v":2.5},{"$f":"VLOOKUP($BQ36,'FMIS and OBD'!$C$3:$DL$200,104,FALSE)","v":2.4464285714285716},null,null,null,null,null,null,null,"Liberia",{"$f":"VLOOKUP($CB36,'FMIS and OBD'!$C$3:$EE$200,132,FALSE)","v":46.153846153846153},{"$f":"VLOOKUP($CB36,'FMIS and OBD'!$C$3:$DL$200,103,FALSE)","v":1.55},{"$f":"VLOOKUP($CB36,'FMIS and OBD'!$C$3:$DL$200,104,FALSE)","v":1.8392857142857142}]
[null,"81 - 100",4,2,null,null,{"$f":"SUM(C37:F37)","v":6},null,null,null,null,null,null,null,null,null,null,null,null,null,null,null,null,null,null,null,null,null,null,null,null,null,null,null,null,null,34,34,{"$f":"COUNTIF('FMIS and OBD'!$BJ$3:$BJ$200,AM$3)","v":100},{"$f":"COUNTIF('FMIS and OBD'!$BJ$3:$BJ$200,AN$3)","v":39},{"$f":"COUNTIF('FMIS and OBD'!$BJ$3:$BJ$200,AO$3)","v":36},{"$f":"COUNTIF('FMIS and OBD'!$BJ$3:$BJ$200,AP$3)","v":23},198,"BJ","Is PF data published on the Statistics web site?    Or another web site?",null,0.50505050505050508,0.19696969696969696,{"$f":"AO37/$AQ37","v":0.18181818181818182},{"$f":"AP37/$AQ37","v":0.11616161616161616},null,34,91,30,31,16,168,null,0.54166666666666663,0.17857142857142858,0.18452380952380953,9.5238095238095233E-2,null,"Ghana","GH",{"$f":"VLOOKUP($BL37,'FMIS and OBD'!$C$3:$EE$200,132,FALSE)","v":61.53846153846154},{"$f":"VLOOKUP($BL37,'FMIS and OBD'!$C$3:$DL$200,105,FALSE)","v":50},null,"El Salvador",{"$f":"VLOOKUP($BQ37,'FMIS and OBD'!$C$3:$EE$200,132,FALSE)","v":84.615384615384613},{"$f":"VLOOKUP($BQ37,'FMIS and OBD'!$C$3:$DL$200,103,FALSE)","v":2.9},{"$f":"VLOOKUP($BQ37,'FMIS and OBD'!$C$3:$DL$200,104,FALSE)","v":2.967741935483871},null,null,null,null,null,null,null,"Macedonia",{"$f":"VLOOKUP($CB37,'FMIS and OBD'!$C$3:$EE$200,132,FALSE)","v":61.53846153846154},{"$f":"VLOOKUP($CB37,'FMIS and OBD'!$C$3:$DL$200,103,FALSE)","v":2.75},{"$f":"VLOOKUP($CB37,'FMIS and OBD'!$C$3:$DL$200,104,FALSE)","v":2.8260869565217392}]
[null,"Sum",{"$f":"SUM(C33:C37)","v":23},{"$f":"SUM(D33:D37)","v":48},{"$f":"SUM(E33:E37)","v":19},{"$f":"SUM(F33:F37)","v":10},{"$f":"SUM(G33:G37)","v":100},null,null,null,null,null,null,null,null,null,null,null,null,null,null,null,null,null,null,null,null,null,null,null,null,null,null,null,null,null,35,35,{"$f":"COUNTIF('FMIS and OBD'!$BP$3:$BP$200,AM$3)","v":145},{"$f":"COUNTIF('FMIS and OBD'!$BP$3:$BP$200,AN$3)","v":53},null,null,{"$f":"SUM(AM38:AP38)","v":198},"BP","Access to information explained?  ",null,0.73232323232323238,0.26767676767676768,null,null,null,35,134,34,null,null,{"$f":"SUM(BA38:BD38)","v":168},null,0.79761904761904767,0.20238095238095238,null,null,null,"Guatemala","GT",{"$f":"VLOOKUP($BL38,'FMIS and OBD'!$C$3:$EE$200,132,FALSE)","v":76.923076923076934},{"$f":"VLOOKUP($BL38,'FMIS and OBD'!$C$3:$DL$200,105,FALSE)","v":51},null,"Ethiopia",{"$f":"VLOOKUP($BQ38,'FMIS and OBD'!$C$3:$EE$200,132,FALSE)","v":30.76923076923077},{"$f":"VLOOKUP($BQ38,'FMIS and OBD'!$C$3:$DL$200,103,FALSE)","v":2.7777777777777777},{"$f":"VLOOKUP($BQ38,'FMIS and OBD'!$C$3:$DL$200,104,FALSE)","v":2.8571428571428572},null,null,null,null,null,null,null,"Maldives",{"$f":"VLOOKUP($CB38,'FMIS and OBD'!$C$3:$EE$200,132,FALSE)","v":34.615384615384613},{"$f":"VLOOKUP($CB38,'FMIS and OBD'!$C$3:$DL$200,103,FALSE)","v":2.1},{"$f":"VLOOKUP($CB38,'FMIS and OBD'!$C$3:$DL$200,104,FALSE)","v":1.9482758620689655}]
[null,null,null,null,null,null,null,null,null,null,null,null,null,null,null,null,null,null,null,"# of points: 4",null,null,null,null,null,null,null,null,null,null,null,null,null,null,null,null,36,36,{"$f":"COUNTIF('FMIS and OBD'!$BR$3:$BR$200,AM$3)","v":55},{"$f":"COUNTIF('FMIS and OBD'!$BR$3:$BR$200,AN$3)","v":143},null,null,{"$f":"SUM(AM39:AP39)","v":198},"BR","Clarity of PFM roles and responsibilities on the web site",null,0.27777777777777779,0.72222222222222221,null,null,null,36,51,117,null,null,{"$f":"SUM(BA39:BD39)","v":168},null,0.30357142857142855,0.6964285714285714,null,null,null,"Honduras","HN",{"$f":"VLOOKUP($BL39,'FMIS and OBD'!$C$3:$EE$200,132,FALSE)","v":69.230769230769226},{"$f":"VLOOKUP($BL39,'FMIS and OBD'!$C$3:$DL$200,105,FALSE)","v":53},null,"Fiji",{"$f":"VLOOKUP($BQ39,'FMIS and OBD'!$C$3:$EE$200,132,FALSE)","v":42.307692307692307},{"$f":"VLOOKUP($BQ39,'FMIS and OBD'!$C$3:$DL$200,103,FALSE)","v":1.85},{"$f":"VLOOKUP($BQ39,'FMIS and OBD'!$C$3:$DL$200,104,FALSE)","v":1.9193548387096775},null,null,null,null,null,null,null,"Mali",{"$f":"VLOOKUP($CB39,'FMIS and OBD'!$C$3:$EE$200,132,FALSE)","v":19.230769230769234},{"$f":"VLOOKUP($CB39,'FMIS and OBD'!$C$3:$DL$200,103,FALSE)","v":2.35},{"$f":"VLOOKUP($CB39,'FMIS and OBD'!$C$3:$DL$200,104,FALSE)","v":2.774193548387097}]
[null,null,null,null,null,null,null,null,null,null,null,null,null,null,null,null,null,null,null,null,null,null,null,null,null,null,null,null,null,null,null,null,null,null,null,null,37,37,{"$f":"COUNTIF('FMIS and OBD'!$BT$3:$BT$200,AM$3)","v":134},{"$f":"COUNTIF('FMIS and OBD'!$BT$3:$BT$200,AN$3)","v":9},{"$f":"COUNTIF('FMIS and OBD'!$BT$3:$BT$200,AO$3)","v":55},null,{"$f":"SUM(AM40:AP40)","v":198},"BT","Compliance with specific int'l standards?",null,0.6767676767676768,4.5454545454545456E-2,{"$f":"AO40/$AQ40","v":0.27777777777777779},null,null,37,117,7,44,null,{"$f":"SUM(BA40:BD40)","v":168},null,0.6964285714285714,4.1666666666666664E-2,0.26190476190476192,null,null,"India","IN",{"$f":"VLOOKUP($BL40,'FMIS and OBD'!$C$3:$EE$200,132,FALSE)","v":80.769230769230774},{"$f":"VLOOKUP($BL40,'FMIS and OBD'!$C$3:$DL$200,105,FALSE)","v":68},null,"Gabon",{"$f":"VLOOKUP($BQ40,'FMIS and OBD'!$C$3:$EE$200,132,FALSE)","v":50},{"$f":"VLOOKUP($BQ40,'FMIS and OBD'!$C$3:$DL$200,103,FALSE)","v":1.875},{"$f":"VLOOKUP($BQ40,'FMIS and OBD'!$C$3:$DL$200,104,FALSE)","v":1.9565217391304348},null,null,null,null,null,null,null,"Mauritania",{"$f":"VLOOKUP($CB40,'FMIS and OBD'!$C$3:$EE$200,132,FALSE)","v":34.615384615384613},{"$f":"VLOOKUP($CB40,'FMIS and OBD'!$C$3:$DL$200,103,FALSE)","v":2.0499999999999998},{"$f":"VLOOKUP($CB40,'FMIS and OBD'!$C$3:$DL$200,104,FALSE)","v":2.2333333333333334}]
[null,"OBI2010","A","B","C","D","Sum",null,null,null,null,null,null,null,null,null,null,null,null,null,null,null,null,null,null,null,null,null,null,null,null,null,null,null,null,null,38,38,{"$f":"COUNTIF('FMIS and OBD'!$BV$3:$BV$200,AM$3)","v":169},{"$f":"COUNTIF('FMIS and OBD'!$BV$3:$BV$200,AN$3)","v":29},null,null,{"$f":"SUM(AM41:AP41)","v":198},"BV","Web statistics",null,0.85353535353535348,0.14646464646464646,null,null,null,38,145,23,null,null,{"$f":"SUM(BA41:BD41)","v":168},null,0.86309523809523814,0.13690476190476192,null,null,null,"Indonesia","ID",{"$f":"VLOOKUP($BL41,'FMIS and OBD'!$C$3:$EE$200,132,FALSE)","v":53.846153846153847},{"$f":"VLOOKUP($BL41,'FMIS and OBD'!$C$3:$DL$200,105,FALSE)","v":62},null,"Gambia",{"$f":"VLOOKUP($BQ41,'FMIS and OBD'!$C$3:$EE$200,132,FALSE)","v":42.307692307692307},{"$f":"VLOOKUP($BQ41,'FMIS and OBD'!$C$3:$DL$200,103,FALSE)","v":1.8888888888888888},{"$f":"VLOOKUP($BQ41,'FMIS and OBD'!$C$3:$DL$200,104,FALSE)","v":2.06},null,null,null,null,null,null,null,"Mauritius",{"$f":"VLOOKUP($CB41,'FMIS and OBD'!$C$3:$EE$200,132,FALSE)","v":69.230769230769226},{"$f":"VLOOKUP($CB41,'FMIS and OBD'!$C$3:$DL$200,103,FALSE)","v":3.7},{"$f":"VLOOKUP($CB41,'FMIS and OBD'!$C$3:$DL$200,104,FALSE)","v":3.1774193548387095}]
[null,"0 - 20",1,6,8,7,{"$f":"SUM(C42:F42)","v":22},null,null,null,null,null,null,null,null,null,null,null,null,null,null,null,null,null,null,null,null,null,null,null,null,null,null,null,null,null,39,39,{"$f":"COUNTIF('FMIS and OBD'!$BW$3:$BW$200,AM$3)","v":25},{"$f":"COUNTIF('FMIS and OBD'!$BW$3:$BW$200,AN$3)","v":45},{"$f":"COUNTIF('FMIS and OBD'!$BW$3:$BW$200,AO$3)","v":28},{"$f":"COUNTIF('FMIS and OBD'!$BW$3:$BW$200,AP$3)","v":100},{"$f":"SUM(AM42:AP42)","v":198},"BW","Platforms for feedback provision",null,0.12626262626262627,0.22727272727272727,{"$f":"AO42/$AQ42","v":0.14141414141414141},{"$f":"AP42/$AQ42","v":0.50505050505050508},null,39,23,41,23,81,{"$f":"SUM(BA42:BD42)","v":168},null,0.13690476190476192,0.24404761904761904,0.13690476190476192,0.48214285714285715,null,"Iraq","IQ",{"$f":"VLOOKUP($BL42,'FMIS and OBD'!$C$3:$EE$200,132,FALSE)","v":26.923076923076923},{"$f":"VLOOKUP($BL42,'FMIS and OBD'!$C$3:$DL$200,105,FALSE)","v":4},null,"Georgia",{"$f":"VLOOKUP($BQ42,'FMIS and OBD'!$C$3:$EE$200,132,FALSE)","v":73.076923076923066},{"$f":"VLOOKUP($BQ42,'FMIS and OBD'!$C$3:$DL$200,103,FALSE)","v":2.6},{"$f":"VLOOKUP($BQ42,'FMIS and OBD'!$C$3:$DL$200,104,FALSE)","v":2.6333333333333333},null,null,null,null,null,null,null,"Montenegro",{"$f":"VLOOKUP($CB42,'FMIS and OBD'!$C$3:$EE$200,132,FALSE)","v":23.076923076923077},{"$f":"VLOOKUP($CB42,'FMIS and OBD'!$C$3:$DL$200,103,FALSE)","v":3},{"$f":"VLOOKUP($CB42,'FMIS and OBD'!$C$3:$DL$200,104,FALSE)","v":2.7166666666666668}]
[null,"21 - 40",3,13,2,1,{"$f":"SUM(C43:F43)","v":19},null,null,null,null,null,null,null,null,null,null,null,null,null,null,null,null,null,null,null,null,null,null,null,null,null,null,null,null,null,null,40,null,null,null,null,null,"BY","Native language",null,null,null,null,null,null,40,null,null,null,null,null,null,null,null,null,null,null,"Italy","IT",{"$f":"VLOOKUP($BL43,'FMIS and OBD'!$C$3:$EE$200,132,FALSE)","v":53.846153846153847},{"$f":"VLOOKUP($BL43,'FMIS and OBD'!$C$3:$DL$200,105,FALSE)","v":60},null,"Ghana",{"$f":"VLOOKUP($BQ43,'FMIS and OBD'!$C$3:$EE$200,132,FALSE)","v":61.53846153846154},{"$f":"VLOOKUP($BQ43,'FMIS and OBD'!$C$3:$DL$200,103,FALSE)","v":2.65},{"$f":"VLOOKUP($BQ43,'FMIS and OBD'!$C$3:$DL$200,104,FALSE)","v":2.4166666666666665},null,null,null,null,null,null,null,"Morocco",{"$f":"VLOOKUP($CB43,'FMIS and OBD'!$C$3:$EE$200,132,FALSE)","v":50},{"$f":"VLOOKUP($CB43,'FMIS and OBD'!$C$3:$DL$200,103,FALSE)","v":2.85},{"$f":"VLOOKUP($CB43,'FMIS and OBD'!$C$3:$DL$200,104,FALSE)","v":2.9833333333333334}]
[null,"41 - 60",5,23,5,null,{"$f":"SUM(C44:F44)","v":33},null,null,null,null,null,null,null,null,null,null,null,null,null,null,null,null,null,null,null,null,null,null,null,null,null,null,null,null,null,null,null,null,null,null,null,null,null,null,null,null,null,null,null,null,null,null,null,null,null,null,null,null,null,null,null,null,"Jordan","JO",{"$f":"VLOOKUP($BL44,'FMIS and OBD'!$C$3:$EE$200,132,FALSE)","v":50},{"$f":"VLOOKUP($BL44,'FMIS and OBD'!$C$3:$DL$200,105,FALSE)","v":57},null,"Grenada",{"$f":"VLOOKUP($BQ44,'FMIS and OBD'!$C$3:$EE$200,132,FALSE)","v":34.615384615384613},{"$f":"VLOOKUP($BQ44,'FMIS and OBD'!$C$3:$DL$200,103,FALSE)","v":2.4500000000000002},{"$f":"VLOOKUP($BQ44,'FMIS and OBD'!$C$3:$DL$200,104,FALSE)","v":2.2166666666666668},null,"Notes:",null,null,null,null,null,"Nepal",{"$f":"VLOOKUP($CB44,'FMIS and OBD'!$C$3:$EE$200,132,FALSE)","v":50},{"$f":"VLOOKUP($CB44,'FMIS and OBD'!$C$3:$DL$200,103,FALSE)","v":2.25},{"$f":"VLOOKUP($CB44,'FMIS and OBD'!$C$3:$DL$200,104,FALSE)","v":2.096774193548387}]
[null,"61 - 80",9,4,null,null,{"$f":"SUM(C45:F45)","v":13},null,null,null,null,null,null,null,null,null,null,null,null,null,null,null,null,null,null,null,null,null,null,null,null,null,null,null,null,null,null,null,null,null,null,null,null,null,null,null,null,null,null,null,null,null,null,null,null,null,null,null,null,null,null,null,null,"Kazakhstan","KZ",{"$f":"VLOOKUP($BL45,'FMIS and OBD'!$C$3:$EE$200,132,FALSE)","v":46.153846153846153},{"$f":"VLOOKUP($BL45,'FMIS and OBD'!$C$3:$DL$200,105,FALSE)","v":48},null,"Guatemala",{"$f":"VLOOKUP($BQ45,'FMIS and OBD'!$C$3:$EE$200,132,FALSE)","v":76.923076923076934},{"$f":"VLOOKUP($BQ45,'FMIS and OBD'!$C$3:$DL$200,103,FALSE)","v":2.5499999999999998},{"$f":"VLOOKUP($BQ45,'FMIS and OBD'!$C$3:$DL$200,104,FALSE)","v":2.4655172413793105},null,"1.    Avg 10 means the average of 10 PEFA indicators selected ",null,null,null,null,null,"Niger",{"$f":"VLOOKUP($CB45,'FMIS and OBD'!$C$3:$EE$200,132,FALSE)","v":0},{"$f":"VLOOKUP($CB45,'FMIS and OBD'!$C$3:$DL$200,103,FALSE)","v":1.65},{"$f":"VLOOKUP($CB45,'FMIS and OBD'!$C$3:$DL$200,104,FALSE)","v":1.9838709677419355}]
[null,"81 - 100",5,2,null,null,{"$f":"SUM(C46:F46)","v":7},null,null,null,null,null,null,null,null,null,null,null,null,null,null,null,null,null,null,null,null,null,null,null,null,null,null,null,null,null,null,null,null,null,null,null,null,null,null,null,null,null,null,null,null,null,null,null,null,null,null,null,null,null,null,null,null,"Kenya","KE",{"$f":"VLOOKUP($BL46,'FMIS and OBD'!$C$3:$EE$200,132,FALSE)","v":50},{"$f":"VLOOKUP($BL46,'FMIS and OBD'!$C$3:$DL$200,105,FALSE)","v":49},null,"Guinea",{"$f":"VLOOKUP($BQ46,'FMIS and OBD'!$C$3:$EE$200,132,FALSE)","v":3.8461538461538463},{"$f":"VLOOKUP($BQ46,'FMIS and OBD'!$C$3:$DL$200,103,FALSE)","v":1.85},{"$f":"VLOOKUP($BQ46,'FMIS and OBD'!$C$3:$DL$200,104,FALSE)","v":1.6129032258064515},null,"for a comparison with the FMIS & OBD Scores",null,null,null,null,null,"Norway",{"$f":"VLOOKUP($CB46,'FMIS and OBD'!$C$3:$EE$200,132,FALSE)","v":73.076923076923066},{"$f":"VLOOKUP($CB46,'FMIS and OBD'!$C$3:$DL$200,103,FALSE)","v":3.1111111111111112},{"$f":"VLOOKUP($CB46,'FMIS and OBD'!$C$3:$DL$200,104,FALSE)","v":3.4107142857142856}]
[null,"Sum",{"$f":"SUM(C42:C46)","v":23},{"$f":"SUM(D42:D46)","v":48},{"$f":"SUM(E42:E46)","v":15},{"$f":"SUM(F42:F46)","v":8},{"$f":"SUM(G42:G46)","v":94},null,null,null,null,null,null,null,null,null,null,null,null,null,null,null,null,null,null,null,null,null,null,null,null,null,null,null,null,null,null,null,null,null,null,null,null,null,null,null,null,null,null,null,null,null,null,null,null,null,null,null,null,null,null,null,null,"Korea, Rep.","KR",{"$f":"VLOOKUP($BL47,'FMIS and OBD'!$C$3:$EE$200,132,FALSE)","v":100},{"$f":"VLOOKUP($BL47,'FMIS and OBD'!$C$3:$DL$200,105,FALSE)","v":75},null,"Guinea-Bissau",{"$f":"VLOOKUP($BQ47,'FMIS and OBD'!$C$3:$EE$200,132,FALSE)","v":42.307692307692307},{"$f":"VLOOKUP($BQ47,'FMIS and OBD'!$C$3:$DL$200,103,FALSE)","v":1.3333333333333333},{"$f":"VLOOKUP($BQ47,'FMIS and OBD'!$C$3:$DL$200,104,FALSE)","v":1.2777777777777777},null,"2.    Avg means the average of all 31 PEFA indicators.",null,null,null,null,null,"Pakistan",{"$f":"VLOOKUP($CB47,'FMIS and OBD'!$C$3:$EE$200,132,FALSE)","v":50},{"$f":"VLOOKUP($CB47,'FMIS and OBD'!$C$3:$DL$200,103,FALSE)","v":2.8},{"$f":"VLOOKUP($CB47,'FMIS and OBD'!$C$3:$DL$200,104,FALSE)","v":2.5499999999999998}]
[null,null,null,null,null,null,null,null,null,null,null,null,null,null,null,null,null,null,null,null,null,null,null,null,null,null,null,null,null,null,null,null,null,null,null,null,null,null,null,null,null,null,null,null,null,null,null,null,null,null,null,null,null,null,null,null,null,null,null,null,null,null,null,"Kyrgyz Republic","KG",{"$f":"VLOOKUP($BL48,'FMIS and OBD'!$C$3:$EE$200,132,FALSE)","v":61.53846153846154},{"$f":"VLOOKUP($BL48,'FMIS and OBD'!$C$3:$DL$200,105,FALSE)","v":20},null,"Guyana",{"$f":"VLOOKUP($BQ48,'FMIS and OBD'!$C$3:$EE$200,132,FALSE)","v":34.615384615384613},{"$f":"VLOOKUP($BQ48,'FMIS and OBD'!$C$3:$DL$200,103,FALSE)","v":2.4},{"$f":"VLOOKUP($BQ48,'FMIS and OBD'!$C$3:$DL$200,104,FALSE)","v":2.25},null,"NR/NA/NU scores are excluded in average calculations.",null,null,null,null,null,"Peru",{"$f":"VLOOKUP($CB48,'FMIS and OBD'!$C$3:$EE$200,132,FALSE)","v":92.307692307692307},{"$f":"VLOOKUP($CB48,'FMIS and OBD'!$C$3:$DL$200,103,FALSE)","v":3.05},{"$f":"VLOOKUP($CB48,'FMIS and OBD'!$C$3:$DL$200,104,FALSE)","v":3.1451612903225805}]
[null,null,null,null,null,null,null,null,null,null,null,null,null,null,null,null,null,null,null,null,null,null,null,null,null,null,null,null,null,null,null,null,null,null,null,null,null,null,null,null,null,null,null,null,null,null,null,null,null,null,null,null,null,null,null,null,null,null,null,null,null,null,null,"Lebanon","LB",{"$f":"VLOOKUP($BL49,'FMIS and OBD'!$C$3:$EE$200,132,FALSE)","v":50},{"$f":"VLOOKUP($BL49,'FMIS and OBD'!$C$3:$DL$200,105,FALSE)","v":33},null,"Haiti",{"$f":"VLOOKUP($BQ49,'FMIS and OBD'!$C$3:$EE$200,132,FALSE)","v":46.153846153846153},{"$f":"VLOOKUP($BQ49,'FMIS and OBD'!$C$3:$DL$200,103,FALSE)","v":1.3333333333333333},{"$f":"VLOOKUP($BQ49,'FMIS and OBD'!$C$3:$DL$200,104,FALSE)","v":1.5},null,null,null,null,null,null,null,"Philippines",{"$f":"VLOOKUP($CB49,'FMIS and OBD'!$C$3:$EE$200,132,FALSE)","v":61.53846153846154},{"$f":"VLOOKUP($CB49,'FMIS and OBD'!$C$3:$DL$200,103,FALSE)","v":1.45},{"$f":"VLOOKUP($CB49,'FMIS and OBD'!$C$3:$DL$200,104,FALSE)","v":2}]
[null,"PEFA Scores (Public)",null,null,null,null,null,null,null,null,null,null,null,null,null,null,null,null,null,null,null,null,null,null,null,null,null,null,null,null,null,null,null,null,null,null,null,null,null,null,null,null,null,null,null,null,null,null,null,null,null,null,null,null,null,null,null,null,null,null,null,null,null,"Liberia","LR",{"$f":"VLOOKUP($BL50,'FMIS and OBD'!$C$3:$EE$200,132,FALSE)","v":46.153846153846153},{"$f":"VLOOKUP($BL50,'FMIS and OBD'!$C$3:$DL$200,105,FALSE)","v":43},null,"Honduras",{"$f":"VLOOKUP($BQ50,'FMIS and OBD'!$C$3:$EE$200,132,FALSE)","v":69.230769230769226},{"$f":"VLOOKUP($BQ50,'FMIS and OBD'!$C$3:$DL$200,103,FALSE)","v":3.05},{"$f":"VLOOKUP($BQ50,'FMIS and OBD'!$C$3:$DL$200,104,FALSE)","v":2.6129032258064515},null,"                PEFA vs. FMIS & OBD Scores (65 public)",null,null,null,null,null,"Rwanda",{"$f":"VLOOKUP($CB50,'FMIS and OBD'!$C$3:$EE$200,132,FALSE)","v":26.923076923076923},{"$f":"VLOOKUP($CB50,'FMIS and OBD'!$C$3:$DL$200,103,FALSE)","v":2.7},{"$f":"VLOOKUP($CB50,'FMIS and OBD'!$C$3:$DL$200,104,FALSE)","v":2.9193548387096775}]
[null,"PEFA","A","B+","B","C+","C","D+","D","NR","Sum","A","B","C","D",null,null,"PFM Topology","Topology",null,null,null,null,null,null,null,null,null,null,null,null,null,null,null,null,null,null,null,null,null,null,null,null,null,null,null,null,null,null,null,null,null,null,null,null,null,null,null,null,null,null,null,null,"Macedonia","MK",{"$f":"VLOOKUP($BL51,'FMIS and OBD'!$C$3:$EE$200,132,FALSE)","v":61.53846153846154},{"$f":"VLOOKUP($BL51,'FMIS and OBD'!$C$3:$DL$200,105,FALSE)","v":35},null,"India",{"$f":"VLOOKUP($BQ51,'FMIS and OBD'!$C$3:$EE$200,132,FALSE)","v":80.769230769230774},{"$f":"VLOOKUP($BQ51,'FMIS and OBD'!$C$3:$DL$200,103,FALSE)","v":2.9444444444444446},{"$f":"VLOOKUP($BQ51,'FMIS and OBD'!$C$3:$DL$200,104,FALSE)","v":2.75},null,null,null,null,null,null,null,"Samoa",{"$f":"VLOOKUP($CB51,'FMIS and OBD'!$C$3:$EE$200,132,FALSE)","v":30.76923076923077},{"$f":"VLOOKUP($CB51,'FMIS and OBD'!$C$3:$DL$200,103,FALSE)","v":2},{"$f":"VLOOKUP($CB51,'FMIS and OBD'!$C$3:$DL$200,104,FALSE)","v":2.0892857142857144}]
[null,"PI-5",19,"-",16,"-",26,"-",4,"-",{"$f":"SUM(C52:J52)","v":65},8,29,20,8,null,null,"Centralized",{"$f":"'FMIS and OBD'!CF204","v":166},{"$f":"S52/S54","v":0.83838383838383834},null,null,null,null,null,null,null,null,null,null,null,null,null,null,null,null,null,null,null,null,null,null,null,null,null,null,null,null,null,null,null,null,null,null,null,null,null,null,null,null,null,null,null,"Malawi","MW",{"$f":"VLOOKUP($BL52,'FMIS and OBD'!$C$3:$EE$200,132,FALSE)","v":46.153846153846153},{"$f":"VLOOKUP($BL52,'FMIS and OBD'!$C$3:$DL$200,105,FALSE)","v":52},null,"Indonesia",{"$f":"VLOOKUP($BQ52,'FMIS and OBD'!$C$3:$EE$200,132,FALSE)","v":53.846153846153847},{"$f":"VLOOKUP($BQ52,'FMIS and OBD'!$C$3:$DL$200,103,FALSE)","v":2.75},{"$f":"VLOOKUP($BQ52,'FMIS and OBD'!$C$3:$DL$200,104,FALSE)","v":2.6451612903225805},null,null,null,null,null,null,null,"São Tomé and Principe",{"$f":"VLOOKUP($CB52,'FMIS and OBD'!$C$3:$EE$200,132,FALSE)","v":0},{"$f":"VLOOKUP($CB52,'FMIS and OBD'!$C$3:$DL$200,103,FALSE)","v":1.55},{"$f":"VLOOKUP($CB52,'FMIS and OBD'!$C$3:$DL$200,104,FALSE)","v":1.7666666666666666}]
[null,"PI-6",30,"-",22,"-",10,"-",2,1,65,null,null,null,null,null,null,"Decentralized",{"$f":"'FMIS and OBD'!CF205","v":32},{"$f":"S53/S54","v":0.16161616161616163},null,null,null,null,null,null,null,null,null,null,null,null,null,null,null,null,null,null,null,null,null,null,null,null,null,null,null,null,null,null,null,null,null,null,null,null,null,null,null,null,null,null,null,"Malaysia","MY",{"$f":"VLOOKUP($BL53,'FMIS and OBD'!$C$3:$EE$200,132,FALSE)","v":50},{"$f":"VLOOKUP($BL53,'FMIS and OBD'!$C$3:$DL$200,105,FALSE)","v":39},null,"Iraq",{"$f":"VLOOKUP($BQ53,'FMIS and OBD'!$C$3:$EE$200,132,FALSE)","v":26.923076923076923},{"$f":"VLOOKUP($BQ53,'FMIS and OBD'!$C$3:$DL$200,103,FALSE)","v":1.35},{"$f":"VLOOKUP($BQ53,'FMIS and OBD'!$C$3:$DL$200,104,FALSE)","v":1.6},null,null,null,null,null,null,null,"Senegal",{"$f":"VLOOKUP($CB53,'FMIS and OBD'!$C$3:$EE$200,132,FALSE)","v":38.461538461538467},{"$f":"VLOOKUP($CB53,'FMIS and OBD'!$C$3:$DL$200,103,FALSE)","v":2.15},{"$f":"VLOOKUP($CB53,'FMIS and OBD'!$C$3:$DL$200,104,FALSE)","v":2.1774193548387095}]
[null,"PI-10",11,"-",26,"-",23,"-",5,"-",65,null,null,null,null,null,null,null,{"$f":"SUM(S52:S53)","v":198},null,null,null,null,null,null,null,null,null,null,null,null,null,null,null,null,null,null,null,null,null,null,null,null,null,null,null,null,null,null,null,null,null,null,null,null,null,null,null,null,null,null,null,null,"Mali","ML",{"$f":"VLOOKUP($BL54,'FMIS and OBD'!$C$3:$EE$200,132,FALSE)","v":19.230769230769234},{"$f":"VLOOKUP($BL54,'FMIS and OBD'!$C$3:$DL$200,105,FALSE)","v":43},null,"Jamaica",{"$f":"VLOOKUP($BQ54,'FMIS and OBD'!$C$3:$EE$200,132,FALSE)","v":34.615384615384613},{"$f":"VLOOKUP($BQ54,'FMIS and OBD'!$C$3:$DL$200,103,FALSE)","v":2.35},{"$f":"VLOOKUP($BQ54,'FMIS and OBD'!$C$3:$DL$200,104,FALSE)","v":2.4333333333333331},null,null,null,null,null,null,null,"Serbia",{"$f":"VLOOKUP($CB54,'FMIS and OBD'!$C$3:$EE$200,132,FALSE)","v":61.53846153846154},{"$f":"VLOOKUP($CB54,'FMIS and OBD'!$C$3:$DL$200,103,FALSE)","v":3.1},{"$f":"VLOOKUP($CB54,'FMIS and OBD'!$C$3:$DL$200,104,FALSE)","v":2.7903225806451615}]
[null,"PI-12","-",5,9,21,11,11,7,1,65,null,null,null,null,null,null,null,null,null,null,null,null,null,null,null,null,null,null,null,null,null,null,null,null,null,null,null,null,null,null,null,null,null,null,null,null,null,null,null,null,null,null,null,null,null,null,null,null,null,null,null,null,"Mexico","MX",{"$f":"VLOOKUP($BL55,'FMIS and OBD'!$C$3:$EE$200,132,FALSE)","v":92.307692307692307},{"$f":"VLOOKUP($BL55,'FMIS and OBD'!$C$3:$DL$200,105,FALSE)","v":61},null,"Jordan",{"$f":"VLOOKUP($BQ55,'FMIS and OBD'!$C$3:$EE$200,132,FALSE)","v":50},{"$f":"VLOOKUP($BQ55,'FMIS and OBD'!$C$3:$DL$200,103,FALSE)","v":2.65},{"$f":"VLOOKUP($BQ55,'FMIS and OBD'!$C$3:$DL$200,104,FALSE)","v":2.6},null,null,null,null,null,null,null,"Seychelles",{"$f":"VLOOKUP($CB55,'FMIS and OBD'!$C$3:$EE$200,132,FALSE)","v":0},{"$f":"VLOOKUP($CB55,'FMIS and OBD'!$C$3:$DL$200,103,FALSE)","v":2.4500000000000002},{"$f":"VLOOKUP($CB55,'FMIS and OBD'!$C$3:$DL$200,104,FALSE)","v":2.5333333333333332}]
[null,"PI-22",12,11,13,7,10,3,6,3,65,null,null,null,null,null,null,null,null,null,null,null,null,null,null,null,null,null,null,null,null,null,null,null,null,null,null,null,null,null,null,null,null,null,null,null,null,null,null,null,null,null,null,null,null,null,null,null,null,null,null,null,null,"Mongolia","MN",{"$f":"VLOOKUP($BL56,'FMIS and OBD'!$C$3:$EE$200,132,FALSE)","v":42.307692307692307},{"$f":"VLOOKUP($BL56,'FMIS and OBD'!$C$3:$DL$200,105,FALSE)","v":51},null,"Kazakhstan",{"$f":"VLOOKUP($BQ56,'FMIS and OBD'!$C$3:$EE$200,132,FALSE)","v":46.153846153846153},{"$f":"VLOOKUP($BQ56,'FMIS and OBD'!$C$3:$DL$200,103,FALSE)","v":2.7777777777777777},{"$f":"VLOOKUP($BQ56,'FMIS and OBD'!$C$3:$DL$200,104,FALSE)","v":3.0535714285714284},null,null,null,null,null,null,null,"Sierra Leone",{"$f":"VLOOKUP($CB56,'FMIS and OBD'!$C$3:$EE$200,132,FALSE)","v":30.76923076923077},{"$f":"VLOOKUP($CB56,'FMIS and OBD'!$C$3:$DL$200,103,FALSE)","v":2.75},{"$f":"VLOOKUP($CB56,'FMIS and OBD'!$C$3:$DL$200,104,FALSE)","v":2.35}]
[null,"PI-23",10,"-",13,"-",7,"-",33,2,65,null,null,null,null,null,null,null,null,null,null,null,null,null,null,null,null,null,null,null,null,null,null,null,null,null,null,null,null,null,null,null,null,null,null,null,null,null,null,null,null,null,null,null,null,null,null,null,null,null,null,null,null,"Morocco","MA",{"$f":"VLOOKUP($BL57,'FMIS and OBD'!$C$3:$EE$200,132,FALSE)","v":50},{"$f":"VLOOKUP($BL57,'FMIS and OBD'!$C$3:$DL$200,105,FALSE)","v":38},null,"Kenya",{"$f":"VLOOKUP($BQ57,'FMIS and OBD'!$C$3:$EE$200,132,FALSE)","v":50},{"$f":"VLOOKUP($BQ57,'FMIS and OBD'!$C$3:$DL$200,103,FALSE)","v":2.2000000000000002},{"$f":"VLOOKUP($BQ57,'FMIS and OBD'!$C$3:$DL$200,104,FALSE)","v":2.3548387096774195},null,null,null,null,null,null,null,"Solomon Islands",{"$f":"VLOOKUP($CB57,'FMIS and OBD'!$C$3:$EE$200,132,FALSE)","v":50},{"$f":"VLOOKUP($CB57,'FMIS and OBD'!$C$3:$DL$200,103,FALSE)","v":2},{"$f":"VLOOKUP($CB57,'FMIS and OBD'!$C$3:$DL$200,104,FALSE)","v":1.8333333333333333}]
[null,"PI-24",5,10,1,34,3,9,3,"-",65,null,null,null,null,null,null,null,null,null,null,null,null,null,null,null,null,null,null,null,null,null,null,null,null,null,null,null,null,null,null,null,null,null,null,null,null,null,null,null,null,null,null,null,null,null,null,null,null,null,null,null,null,"Mozambique","MZ",{"$f":"VLOOKUP($BL58,'FMIS and OBD'!$C$3:$EE$200,132,FALSE)","v":38.461538461538467},{"$f":"VLOOKUP($BL58,'FMIS and OBD'!$C$3:$DL$200,105,FALSE)","v":47},null,"Kiribati",{"$f":"VLOOKUP($BQ58,'FMIS and OBD'!$C$3:$EE$200,132,FALSE)","v":19.230769230769234},{"$f":"VLOOKUP($BQ58,'FMIS and OBD'!$C$3:$DL$200,103,FALSE)","v":1.5},{"$f":"VLOOKUP($BQ58,'FMIS and OBD'!$C$3:$DL$200,104,FALSE)","v":1.8275862068965518},null,null,null,null,null,null,null,"South Africa",{"$f":"VLOOKUP($CB58,'FMIS and OBD'!$C$3:$EE$200,132,FALSE)","v":69.230769230769226},{"$f":"VLOOKUP($CB58,'FMIS and OBD'!$C$3:$DL$200,103,FALSE)","v":3.35},{"$f":"VLOOKUP($CB58,'FMIS and OBD'!$C$3:$DL$200,104,FALSE)","v":3.3225806451612905}]
[null,"PI-25",9,4,"-",24,2,23,3,"-",65,null,null,null,null,null,null,null,null,null,null,null,null,null,null,null,null,null,null,null,null,null,null,null,null,null,null,null,null,null,null,null,null,null,null,null,null,null,null,null,null,null,null,null,null,null,null,null,null,null,null,null,null,"Myanmar","MM",{"$f":"VLOOKUP($BL59,'FMIS and OBD'!$C$3:$EE$200,132,FALSE)","v":0},{"$f":"VLOOKUP($BL59,'FMIS and OBD'!$C$3:$DL$200,105,FALSE)","v":0},null,"Kosovo",{"$f":"VLOOKUP($BQ59,'FMIS and OBD'!$C$3:$EE$200,132,FALSE)","v":38.461538461538467},{"$f":"VLOOKUP($BQ59,'FMIS and OBD'!$C$3:$DL$200,103,FALSE)","v":2.8},{"$f":"VLOOKUP($BQ59,'FMIS and OBD'!$C$3:$DL$200,104,FALSE)","v":2.774193548387097},null,null,null,null,null,null,null,"Tajikistan",{"$f":"VLOOKUP($CB59,'FMIS and OBD'!$C$3:$EE$200,132,FALSE)","v":42.307692307692307},{"$f":"VLOOKUP($CB59,'FMIS and OBD'!$C$3:$DL$200,103,FALSE)","v":1.95},{"$f":"VLOOKUP($CB59,'FMIS and OBD'!$C$3:$DL$200,104,FALSE)","v":2.0666666666666669}]
[null,"PI-26","-",9,7,13,3,23,9,1,65,null,null,null,null,null,null,"FMIS Func","Functionality",null,null,null,null,null,null,null,null,null,null,null,null,null,null,null,null,null,null,null,null,null,null,null,null,null,null,null,null,null,null,null,null,null,null,null,null,null,null,null,null,null,null,null,null,"Namibia","NA",{"$f":"VLOOKUP($BL60,'FMIS and OBD'!$C$3:$EE$200,132,FALSE)","v":69.230769230769226},{"$f":"VLOOKUP($BL60,'FMIS and OBD'!$C$3:$DL$200,105,FALSE)","v":55},null,"Kuwait",{"$f":"VLOOKUP($BQ60,'FMIS and OBD'!$C$3:$EE$200,132,FALSE)","v":26.923076923076923},{"$f":"VLOOKUP($BQ60,'FMIS and OBD'!$C$3:$DL$200,103,FALSE)","v":2.7222222222222223},{"$f":"VLOOKUP($BQ60,'FMIS and OBD'!$C$3:$DL$200,104,FALSE)","v":2.9464285714285716},null,null,null,null,null,null,null,"Tanzania",{"$f":"VLOOKUP($CB60,'FMIS and OBD'!$C$3:$EE$200,132,FALSE)","v":57.692307692307686},{"$f":"VLOOKUP($CB60,'FMIS and OBD'!$C$3:$DL$200,103,FALSE)","v":2.6111111111111112},{"$f":"VLOOKUP($CB60,'FMIS and OBD'!$C$3:$DL$200,104,FALSE)","v":2.4423076923076925}]
[null,"D-2",3,"-",1,7,12,19,17,6,65,null,null,null,null,null,null,"FMIS (B+T)",{"$f":"'FMIS and OBD'!CG204","v":119},{"$f":"S61/S63","v":0.67231638418079098},null,null,null,null,null,null,null,null,null,null,null,null,null,null,null,null,null,null,null,null,null,null,null,null,null,null,null,null,null,null,null,null,null,null,null,null,null,null,null,null,null,null,null,"Nepal","NP",{"$f":"VLOOKUP($BL61,'FMIS and OBD'!$C$3:$EE$200,132,FALSE)","v":50},{"$f":"VLOOKUP($BL61,'FMIS and OBD'!$C$3:$DL$200,105,FALSE)","v":44},null,"Kyrgyz Republic",{"$f":"VLOOKUP($BQ61,'FMIS and OBD'!$C$3:$EE$200,132,FALSE)","v":61.53846153846154},{"$f":"VLOOKUP($BQ61,'FMIS and OBD'!$C$3:$DL$200,103,FALSE)","v":2.25},{"$f":"VLOOKUP($BQ61,'FMIS and OBD'!$C$3:$DL$200,104,FALSE)","v":2.0499999999999998},null,null,null,null,null,null,null,"Timor-Leste",{"$f":"VLOOKUP($CB61,'FMIS and OBD'!$C$3:$EE$200,132,FALSE)","v":61.53846153846154},{"$f":"VLOOKUP($CB61,'FMIS and OBD'!$C$3:$DL$200,103,FALSE)","v":2.4500000000000002},{"$f":"VLOOKUP($CB61,'FMIS and OBD'!$C$3:$DL$200,104,FALSE)","v":2.0862068965517242}]
[null,null,null,null,null,null,null,null,null,null,null,null,null,null,null,null,null,"Treasury (T)",{"$f":"'FMIS and OBD'!CG205","v":58},{"$f":"S62/S63","v":0.32768361581920902},null,null,null,null,null,null,null,null,null,null,null,null,null,null,null,null,null,null,null,null,null,null,null,null,null,null,null,null,null,null,null,null,null,null,null,null,null,null,null,null,null,null,null,"New Zealand","NZ",{"$f":"VLOOKUP($BL62,'FMIS and OBD'!$C$3:$EE$200,132,FALSE)","v":92.307692307692307},{"$f":"VLOOKUP($BL62,'FMIS and OBD'!$C$3:$DL$200,105,FALSE)","v":93},null,"Lao PDR",{"$f":"VLOOKUP($BQ62,'FMIS and OBD'!$C$3:$EE$200,132,FALSE)","v":26.923076923076923},{"$f":"VLOOKUP($BQ62,'FMIS and OBD'!$C$3:$DL$200,103,FALSE)","v":1.95},{"$f":"VLOOKUP($BQ62,'FMIS and OBD'!$C$3:$DL$200,104,FALSE)","v":2},null,null,null,null,null,null,null,"Togo",{"$f":"VLOOKUP($CB62,'FMIS and OBD'!$C$3:$EE$200,132,FALSE)","v":3.8461538461538463},{"$f":"VLOOKUP($CB62,'FMIS and OBD'!$C$3:$DL$200,103,FALSE)","v":1.2777777777777777},{"$f":"VLOOKUP($CB62,'FMIS and OBD'!$C$3:$DL$200,104,FALSE)","v":1.5925925925925926}]
[null,"PEFA Scores (Public + Final)",null,null,null,null,null,null,null,null,null,null,null,null,null,null,null,null,{"$f":"SUM(S61:S62)","v":177},null,null,null,null,null,null,null,null,null,null,null,null,null,null,null,null,null,null,null,null,null,null,null,null,null,null,null,null,null,null,null,null,null,null,null,null,null,null,null,null,null,null,null,null,"Nicaragua","NI",{"$f":"VLOOKUP($BL63,'FMIS and OBD'!$C$3:$EE$200,132,FALSE)","v":92.307692307692307},{"$f":"VLOOKUP($BL63,'FMIS and OBD'!$C$3:$DL$200,105,FALSE)","v":42},null,"Lebanon",{"$f":"VLOOKUP($BQ63,'FMIS and OBD'!$C$3:$EE$200,132,FALSE)","v":50},{"$f":"VLOOKUP($BQ63,'FMIS and OBD'!$C$3:$DL$200,103,FALSE)","v":1.8333333333333333},{"$f":"VLOOKUP($BQ63,'FMIS and OBD'!$C$3:$DL$200,104,FALSE)","v":1.6956521739130435},null,null,null,null,null,null,null,"Tonga",{"$f":"VLOOKUP($CB63,'FMIS and OBD'!$C$3:$EE$200,132,FALSE)","v":50},{"$f":"VLOOKUP($CB63,'FMIS and OBD'!$C$3:$DL$200,103,FALSE)","v":2.0499999999999998},{"$f":"VLOOKUP($CB63,'FMIS and OBD'!$C$3:$DL$200,104,FALSE)","v":2.6071428571428572}]
[null,"PEFA","A","B+","B","C+","C","D+","D","NR","Sum","A","B","C","D",null,null,null,null,null,null,null,null,null,null,null,null,null,null,null,null,null,null,null,null,null,null,null,null,null,null,null,null,null,null,null,null,null,null,null,null,null,null,null,null,null,null,null,null,null,null,null,null,"Niger","NE",{"$f":"VLOOKUP($BL64,'FMIS and OBD'!$C$3:$EE$200,132,FALSE)","v":0},{"$f":"VLOOKUP($BL64,'FMIS and OBD'!$C$3:$DL$200,105,FALSE)","v":4},null,"Lesotho",{"$f":"VLOOKUP($BQ64,'FMIS and OBD'!$C$3:$EE$200,132,FALSE)","v":46.153846153846153},{"$f":"VLOOKUP($BQ64,'FMIS and OBD'!$C$3:$DL$200,103,FALSE)","v":1.95},{"$f":"VLOOKUP($BQ64,'FMIS and OBD'!$C$3:$DL$200,104,FALSE)","v":2.0172413793103448},null,null,null,null,null,null,null,"Trinidad and Tobago",{"$f":"VLOOKUP($CB64,'FMIS and OBD'!$C$3:$EE$200,132,FALSE)","v":46.153846153846153},{"$f":"VLOOKUP($CB64,'FMIS and OBD'!$C$3:$DL$200,103,FALSE)","v":2.5},{"$f":"VLOOKUP($CB64,'FMIS and OBD'!$C$3:$DL$200,104,FALSE)","v":2.6666666666666665}]
[null,"PI-5",27,"-",27,"-",36,"-",7,"-",{"$f":"SUM(C65:J65)","v":97},9,38,33,17,null,null,null,null,null,null,null,null,null,null,null,null,null,null,null,null,null,null,null,null,null,null,null,null,null,null,null,null,null,null,null,null,null,null,null,null,null,null,null,null,null,null,null,null,null,null,null,null,"Nigeria","NG",{"$f":"VLOOKUP($BL65,'FMIS and OBD'!$C$3:$EE$200,132,FALSE)","v":38.461538461538467},{"$f":"VLOOKUP($BL65,'FMIS and OBD'!$C$3:$DL$200,105,FALSE)","v":16},null,"Liberia",{"$f":"VLOOKUP($BQ65,'FMIS and OBD'!$C$3:$EE$200,132,FALSE)","v":46.153846153846153},{"$f":"VLOOKUP($BQ65,'FMIS and OBD'!$C$3:$DL$200,103,FALSE)","v":1.55},{"$f":"VLOOKUP($BQ65,'FMIS and OBD'!$C$3:$DL$200,104,FALSE)","v":1.8392857142857142},null,null,null,null,null,null,null,"Tunisia",{"$f":"VLOOKUP($CB65,'FMIS and OBD'!$C$3:$EE$200,132,FALSE)","v":34.615384615384613},{"$f":"VLOOKUP($CB65,'FMIS and OBD'!$C$3:$DL$200,103,FALSE)","v":2.85},{"$f":"VLOOKUP($CB65,'FMIS and OBD'!$C$3:$DL$200,104,FALSE)","v":3.0483870967741935}]
[null,"PI-6",38,"-",34,"-",19,"-",5,1,97,null,null,null,null,null,null,null,null,null,null,null,null,null,null,null,null,null,null,null,null,null,null,null,null,null,null,null,null,null,null,null,null,null,null,null,null,null,null,null,null,null,null,null,null,null,null,null,null,null,null,null,null,"Norway","NO",{"$f":"VLOOKUP($BL66,'FMIS and OBD'!$C$3:$EE$200,132,FALSE)","v":73.076923076923066},{"$f":"VLOOKUP($BL66,'FMIS and OBD'!$C$3:$DL$200,105,FALSE)","v":83},null,"Macedonia",{"$f":"VLOOKUP($BQ66,'FMIS and OBD'!$C$3:$EE$200,132,FALSE)","v":61.53846153846154},{"$f":"VLOOKUP($BQ66,'FMIS and OBD'!$C$3:$DL$200,103,FALSE)","v":2.75},{"$f":"VLOOKUP($BQ66,'FMIS and OBD'!$C$3:$DL$200,104,FALSE)","v":2.8260869565217392},null,null,null,null,null,null,null,"Uganda",{"$f":"VLOOKUP($CB66,'FMIS and OBD'!$C$3:$EE$200,132,FALSE)","v":57.692307692307686},{"$f":"VLOOKUP($CB66,'FMIS and OBD'!$C$3:$DL$200,103,FALSE)","v":2.9},{"$f":"VLOOKUP($CB66,'FMIS and OBD'!$C$3:$DL$200,104,FALSE)","v":2.370967741935484}]
[null,"PI-10",16,"-",37,"-",34,"-",10,"-",97,null,null,null,null,null,null,null,null,null,null,null,null,null,null,null,null,null,null,null,null,null,null,null,null,null,null,null,null,null,null,null,null,null,null,null,null,null,null,null,null,null,null,null,null,null,null,null,null,null,null,null,null,"Pakistan","PK",{"$f":"VLOOKUP($BL67,'FMIS and OBD'!$C$3:$EE$200,132,FALSE)","v":50},{"$f":"VLOOKUP($BL67,'FMIS and OBD'!$C$3:$DL$200,105,FALSE)","v":58},null,"Madagascar",{"$f":"VLOOKUP($BQ67,'FMIS and OBD'!$C$3:$EE$200,132,FALSE)","v":61.53846153846154},{"$f":"VLOOKUP($BQ67,'FMIS and OBD'!$C$3:$DL$200,103,FALSE)","v":2.15},{"$f":"VLOOKUP($BQ67,'FMIS and OBD'!$C$3:$DL$200,104,FALSE)","v":2.403225806451613},null,null,null,null,null,null,null,"West Bank and Gaza",{"$f":"VLOOKUP($CB67,'FMIS and OBD'!$C$3:$EE$200,132,FALSE)","v":46.153846153846153},{"$f":"VLOOKUP($CB67,'FMIS and OBD'!$C$3:$DL$200,103,FALSE)","v":1.75},{"$f":"VLOOKUP($CB67,'FMIS and OBD'!$C$3:$DL$200,104,FALSE)","v":1.8888888888888888}]
[null,"PI-12","-",7,10,33,17,20,9,1,97,null,null,null,null,null,null,null,null,null,null,null,null,null,null,null,null,null,null,null,null,null,null,null,null,null,null,null,null,null,null,null,null,null,null,null,null,null,null,null,null,null,null,null,null,null,null,null,null,null,null,null,null,"Papua New Guinea","PG",{"$f":"VLOOKUP($BL68,'FMIS and OBD'!$C$3:$EE$200,132,FALSE)","v":42.307692307692307},{"$f":"VLOOKUP($BL68,'FMIS and OBD'!$C$3:$DL$200,105,FALSE)","v":56},null,"Malawi",{"$f":"VLOOKUP($BQ68,'FMIS and OBD'!$C$3:$EE$200,132,FALSE)","v":46.153846153846153},{"$f":"VLOOKUP($BQ68,'FMIS and OBD'!$C$3:$DL$200,103,FALSE)","v":2.2999999999999998},{"$f":"VLOOKUP($BQ68,'FMIS and OBD'!$C$3:$DL$200,104,FALSE)","v":2.3703703703703702},null,null,null,null,null,null,null,"Yemen",{"$f":"VLOOKUP($CB68,'FMIS and OBD'!$C$3:$EE$200,132,FALSE)","v":34.615384615384613},{"$f":"VLOOKUP($CB68,'FMIS and OBD'!$C$3:$DL$200,103,FALSE)","v":2.6},{"$f":"VLOOKUP($CB68,'FMIS and OBD'!$C$3:$DL$200,104,FALSE)","v":2.3833333333333333}]
[null,"PI-22",19,16,18,11,14,7,9,3,97,null,null,null,null,null,null,"FMIS Status","Status",null,null,null,null,null,null,null,null,null,null,null,null,null,null,null,null,null,null,null,null,null,null,null,null,null,null,null,null,null,null,null,null,null,null,null,null,null,null,null,null,null,null,null,null,"Peru","PE",{"$f":"VLOOKUP($BL69,'FMIS and OBD'!$C$3:$EE$200,132,FALSE)","v":92.307692307692307},{"$f":"VLOOKUP($BL69,'FMIS and OBD'!$C$3:$DL$200,105,FALSE)","v":57},null,"Maldives",{"$f":"VLOOKUP($BQ69,'FMIS and OBD'!$C$3:$EE$200,132,FALSE)","v":34.615384615384613},{"$f":"VLOOKUP($BQ69,'FMIS and OBD'!$C$3:$DL$200,103,FALSE)","v":2.1},{"$f":"VLOOKUP($BQ69,'FMIS and OBD'!$C$3:$DL$200,104,FALSE)","v":1.9482758620689655}]
[null,"PI-23",13,"-",17,"-",12,"-",50,5,97,null,null,null,null,null,null,"Operational",{"$f":"'FMIS and OBD'!CH204","v":116},{"$f":"S70/S74","v":0.65536723163841804},null,null,null,null,null,null,null,null,null,null,null,null,null,null,null,null,null,null,null,null,null,null,null,null,null,null,null,null,null,null,null,null,null,null,null,null,null,null,null,null,null,null,null,"Philippines","PH",{"$f":"VLOOKUP($BL70,'FMIS and OBD'!$C$3:$EE$200,132,FALSE)","v":61.53846153846154},{"$f":"VLOOKUP($BL70,'FMIS and OBD'!$C$3:$DL$200,105,FALSE)","v":48},null,"Mali",{"$f":"VLOOKUP($BQ70,'FMIS and OBD'!$C$3:$EE$200,132,FALSE)","v":19.230769230769234},{"$f":"VLOOKUP($BQ70,'FMIS and OBD'!$C$3:$DL$200,103,FALSE)","v":2.35},{"$f":"VLOOKUP($BQ70,'FMIS and OBD'!$C$3:$DL$200,104,FALSE)","v":2.774193548387097}]
[null,"PI-24",8,13,2,46,8,14,6,"-",97,null,null,null,null,null,null,"Pilot",{"$f":"'FMIS and OBD'!CH205","v":9},{"$f":"S71/S74","v":5.0847457627118647E-2},null,null,null,null,null,null,null,null,null,null,null,null,null,null,null,null,null,null,null,null,null,null,null,null,null,null,null,null,null,null,null,null,null,null,null,null,null,null,null,null,null,null,null,"Poland","PL",{"$f":"VLOOKUP($BL71,'FMIS and OBD'!$C$3:$EE$200,132,FALSE)","v":61.53846153846154},{"$f":"VLOOKUP($BL71,'FMIS and OBD'!$C$3:$DL$200,105,FALSE)","v":59},null,"Marshall Islands",{"$f":"VLOOKUP($BQ71,'FMIS and OBD'!$C$3:$EE$200,132,FALSE)","v":11.538461538461538},{"$f":"VLOOKUP($BQ71,'FMIS and OBD'!$C$3:$DL$200,103,FALSE)","v":1.1666666666666667},{"$f":"VLOOKUP($BQ71,'FMIS and OBD'!$C$3:$DL$200,104,FALSE)","v":1.6481481481481481}]
[null,"PI-25",10,7,"-",35,4,36,5,"-",97,null,null,null,null,null,null,"In progress",{"$f":"'FMIS and OBD'!CH206","v":47},{"$f":"S72/S74","v":0.2655367231638418},null,null,null,null,null,null,null,null,null,null,null,null,null,null,null,null,null,null,null,null,null,null,null,null,null,null,null,null,null,null,null,null,null,null,null,null,null,null,null,null,null,null,null,"Portugal","PT",{"$f":"VLOOKUP($BL72,'FMIS and OBD'!$C$3:$EE$200,132,FALSE)","v":65.384615384615387},{"$f":"VLOOKUP($BL72,'FMIS and OBD'!$C$3:$DL$200,105,FALSE)","v":62},null,"Mauritania",{"$f":"VLOOKUP($BQ72,'FMIS and OBD'!$C$3:$EE$200,132,FALSE)","v":34.615384615384613},{"$f":"VLOOKUP($BQ72,'FMIS and OBD'!$C$3:$DL$200,103,FALSE)","v":2.0499999999999998},{"$f":"VLOOKUP($BQ72,'FMIS and OBD'!$C$3:$DL$200,104,FALSE)","v":2.2333333333333334}]
[null,"PI-26","-",12,9,17,3,35,19,2,97,null,null,null,null,null,null,"Pipeline",{"$f":"'FMIS and OBD'!CH207","v":5},{"$f":"S73/S74","v":2.8248587570621469E-2},null,null,null,null,null,null,null,null,null,null,null,null,null,null,null,null,null,null,null,null,null,null,null,null,null,null,null,null,null,null,null,null,null,null,null,null,null,null,null,null,null,null,null,"Qatar","QA",{"$f":"VLOOKUP($BL73,'FMIS and OBD'!$C$3:$EE$200,132,FALSE)","v":7.6923076923076925},{"$f":"VLOOKUP($BL73,'FMIS and OBD'!$C$3:$DL$200,105,FALSE)","v":0},null,"Mauritius",{"$f":"VLOOKUP($BQ73,'FMIS and OBD'!$C$3:$EE$200,132,FALSE)","v":69.230769230769226},{"$f":"VLOOKUP($BQ73,'FMIS and OBD'!$C$3:$DL$200,103,FALSE)","v":3.7},{"$f":"VLOOKUP($BQ73,'FMIS and OBD'!$C$3:$DL$200,104,FALSE)","v":3.1774193548387095}]
[null,"D-2",3,1,3,9,15,26,27,13,97,null,null,null,null,null,null,null,{"$f":"SUM(S70:S73)","v":177},null,null,null,null,null,null,null,null,null,null,null,null,null,null,null,null,null,null,null,null,null,null,null,null,null,null,null,null,null,null,null,null,null,null,null,null,null,null,null,null,null,null,null,null,"Romania","RO",{"$f":"VLOOKUP($BL74,'FMIS and OBD'!$C$3:$EE$200,132,FALSE)","v":57.692307692307686},{"$f":"VLOOKUP($BL74,'FMIS and OBD'!$C$3:$DL$200,105,FALSE)","v":47},null,"Micronesia, Fed. Sts.",{"$f":"VLOOKUP($BQ74,'FMIS and OBD'!$C$3:$EE$200,132,FALSE)","v":38.461538461538467},{"$f":"VLOOKUP($BQ74,'FMIS and OBD'!$C$3:$DL$200,103,FALSE)","v":1.7222222222222223},{"$f":"VLOOKUP($BQ74,'FMIS and OBD'!$C$3:$DL$200,104,FALSE)","v":1.8653846153846154}]
[null,null,null,null,null,null,null,null,null,null,null,null,null,null,null,null,null,null,null,null,null,null,null,null,null,null,null,null,null,null,null,null,null,null,null,null,null,null,null,null,null,null,null,null,null,null,null,null,null,null,null,null,null,null,null,null,null,null,null,null,null,null,null,"Russian Federation","RU",{"$f":"VLOOKUP($BL75,'FMIS and OBD'!$C$3:$EE$200,132,FALSE)","v":80.769230769230774},{"$f":"VLOOKUP($BL75,'FMIS and OBD'!$C$3:$DL$200,105,FALSE)","v":74},null,"Moldova",{"$f":"VLOOKUP($BQ75,'FMIS and OBD'!$C$3:$EE$200,132,FALSE)","v":69.230769230769226},{"$f":"VLOOKUP($BQ75,'FMIS and OBD'!$C$3:$DL$200,103,FALSE)","v":3.35},{"$f":"VLOOKUP($BQ75,'FMIS and OBD'!$C$3:$DL$200,104,FALSE)","v":3.193548387096774}]
[null,"PEFA Scores (All = Public + Final + Draft)",null,null,null,null,null,null,null,null,null,null,null,null,null,null,null,null,null,null,null,null,null,null,null,null,null,null,null,null,null,null,null,null,null,null,null,null,null,null,null,null,null,null,null,null,null,null,null,null,null,null,null,null,null,null,null,null,null,null,null,null,null,"Rwanda","RW",{"$f":"VLOOKUP($BL76,'FMIS and OBD'!$C$3:$EE$200,132,FALSE)","v":26.923076923076923},{"$f":"VLOOKUP($BL76,'FMIS and OBD'!$C$3:$DL$200,105,FALSE)","v":8},null,"Montenegro",{"$f":"VLOOKUP($BQ76,'FMIS and OBD'!$C$3:$EE$200,132,FALSE)","v":23.076923076923077},{"$f":"VLOOKUP($BQ76,'FMIS and OBD'!$C$3:$DL$200,103,FALSE)","v":3},{"$f":"VLOOKUP($BQ76,'FMIS and OBD'!$C$3:$DL$200,104,FALSE)","v":2.7166666666666668}]
[null,"PEFA","A","B+","B","C+","C","D+","D","NR","Sum","A","B","C","D",null,null,null,null,null,null,null,null,null,null,null,null,null,null,null,null,null,null,null,null,null,null,null,null,null,null,null,null,null,null,null,null,null,null,null,null,null,null,null,null,null,null,null,null,null,null,null,null,"São Tomé and Principe","ST",{"$f":"VLOOKUP($BL77,'FMIS and OBD'!$C$3:$EE$200,132,FALSE)","v":0},{"$f":"VLOOKUP($BL77,'FMIS and OBD'!$C$3:$DL$200,105,FALSE)","v":29},null,"Morocco",{"$f":"VLOOKUP($BQ77,'FMIS and OBD'!$C$3:$EE$200,132,FALSE)","v":50},{"$f":"VLOOKUP($BQ77,'FMIS and OBD'!$C$3:$DL$200,103,FALSE)","v":2.85},{"$f":"VLOOKUP($BQ77,'FMIS and OBD'!$C$3:$DL$200,104,FALSE)","v":2.9833333333333334}]
[null,"PI-5",34,"-",34,"-",42,"-",11,"-",{"$f":"SUM(C78:J78)","v":121},13,43,44,21,null,null,"FMIS Opr  Yr","Since",null,null,null,null,null,null,null,null,null,null,null,null,null,null,null,null,null,null,null,null,null,null,null,null,null,null,null,null,null,null,null,null,null,null,null,null,null,null,null,null,null,null,null,null,"Saudi Arabia","SA",{"$f":"VLOOKUP($BL78,'FMIS and OBD'!$C$3:$EE$200,132,FALSE)","v":26.923076923076923},{"$f":"VLOOKUP($BL78,'FMIS and OBD'!$C$3:$DL$200,105,FALSE)","v":1},null,"Mozambique",{"$f":"VLOOKUP($BQ78,'FMIS and OBD'!$C$3:$EE$200,132,FALSE)","v":38.461538461538467},{"$f":"VLOOKUP($BQ78,'FMIS and OBD'!$C$3:$DL$200,103,FALSE)","v":2.5499999999999998},{"$f":"VLOOKUP($BQ78,'FMIS and OBD'!$C$3:$DL$200,104,FALSE)","v":2.838709677419355}]
[null,"PI-6",46,"-",42,"-",25,"-",7,1,121,null,null,null,null,null,null,"< 2000",{"$f":"'FMIS and OBD'!CI204","v":16},{"$f":"S79/S83","v":9.03954802259887E-2},null,null,null,null,null,null,null,null,null,null,null,null,null,null,null,null,null,null,null,null,null,null,null,null,null,null,null,null,null,null,null,null,null,null,null,null,null,null,null,null,null,null,null,"Senegal","SN",{"$f":"VLOOKUP($BL79,'FMIS and OBD'!$C$3:$EE$200,132,FALSE)","v":38.461538461538467},{"$f":"VLOOKUP($BL79,'FMIS and OBD'!$C$3:$DL$200,105,FALSE)","v":10},null,"Namibia",{"$f":"VLOOKUP($BQ79,'FMIS and OBD'!$C$3:$EE$200,132,FALSE)","v":69.230769230769226},{"$f":"VLOOKUP($BQ79,'FMIS and OBD'!$C$3:$DL$200,103,FALSE)","v":2.8},{"$f":"VLOOKUP($BQ79,'FMIS and OBD'!$C$3:$DL$200,104,FALSE)","v":2.7}]
[null,"PI-10",18,"-",42,"-",47,"-",14,"-",121,null,null,null,null,null,null,"2000-2005",{"$f":"'FMIS and OBD'!CI205","v":38},{"$f":"S80/S83","v":0.21468926553672316},null,null,null,null,null,null,null,null,null,null,null,null,null,null,null,null,null,null,null,null,null,null,null,null,null,null,null,null,null,null,null,null,null,null,null,null,null,null,null,null,null,null,null,"Serbia","RS",{"$f":"VLOOKUP($BL80,'FMIS and OBD'!$C$3:$EE$200,132,FALSE)","v":61.53846153846154},{"$f":"VLOOKUP($BL80,'FMIS and OBD'!$C$3:$DL$200,105,FALSE)","v":39},null,"Nauru",{"$f":"VLOOKUP($BQ80,'FMIS and OBD'!$C$3:$EE$200,132,FALSE)","v":0},{"$f":"VLOOKUP($BQ80,'FMIS and OBD'!$C$3:$DL$200,103,FALSE)","v":1.625},{"$f":"VLOOKUP($BQ80,'FMIS and OBD'!$C$3:$DL$200,104,FALSE)","v":1.7173913043478262}]
[null,"PI-12",1,7,11,42,20,27,12,1,121,null,null,null,null,null,null,"2005-2010",{"$f":"'FMIS and OBD'!CI206","v":50},{"$f":"S81/S83","v":0.2824858757062147},null,null,null,null,null,null,null,null,null,null,null,null,null,null,null,null,null,null,null,null,null,null,null,null,null,null,null,null,null,null,null,null,null,null,null,null,null,null,null,null,null,null,null,"Sierra Leone","SL",{"$f":"VLOOKUP($BL81,'FMIS and OBD'!$C$3:$EE$200,132,FALSE)","v":30.76923076923077},{"$f":"VLOOKUP($BL81,'FMIS and OBD'!$C$3:$DL$200,105,FALSE)","v":39},null,"Nepal",{"$f":"VLOOKUP($BQ81,'FMIS and OBD'!$C$3:$EE$200,132,FALSE)","v":50},{"$f":"VLOOKUP($BQ81,'FMIS and OBD'!$C$3:$DL$200,103,FALSE)","v":2.25},{"$f":"VLOOKUP($BQ81,'FMIS and OBD'!$C$3:$DL$200,104,FALSE)","v":2.096774193548387}]
[null,"PI-22",21,18,20,14,18,7,19,4,121,null,null,null,null,null,null,"> 2010",{"$f":"'FMIS and OBD'!CI207","v":73},{"$f":"S82/S83","v":0.41242937853107342},null,null,null,null,null,null,null,null,null,null,null,null,null,null,null,null,null,null,null,null,null,null,null,null,null,null,null,null,null,null,null,null,null,null,null,null,null,null,null,null,null,null,null,"Slovak Republic","SK",{"$f":"VLOOKUP($BL82,'FMIS and OBD'!$C$3:$EE$200,132,FALSE)","v":69.230769230769226},{"$f":"VLOOKUP($BL82,'FMIS and OBD'!$C$3:$DL$200,105,FALSE)","v":67},null,"Nicaragua",{"$f":"VLOOKUP($BQ82,'FMIS and OBD'!$C$3:$EE$200,132,FALSE)","v":92.307692307692307},{"$f":"VLOOKUP($BQ82,'FMIS and OBD'!$C$3:$DL$200,103,FALSE)","v":2.1666666666666665},{"$f":"VLOOKUP($BQ82,'FMIS and OBD'!$C$3:$DL$200,104,FALSE)","v":2.4629629629629628}]
[null,"PI-23",13,"-",19,"-",13,"-",70,6,121,null,null,null,null,null,null,null,{"$f":"SUM(S79:S82)","v":177},null,null,null,null,null,null,null,null,null,null,null,null,null,null,null,null,null,null,null,null,null,null,null,null,null,null,null,null,null,null,null,null,null,null,null,null,null,null,null,null,null,null,null,null,"Slovenia","SI",{"$f":"VLOOKUP($BL83,'FMIS and OBD'!$C$3:$EE$200,132,FALSE)","v":76.923076923076934},{"$f":"VLOOKUP($BL83,'FMIS and OBD'!$C$3:$DL$200,105,FALSE)","v":74},null,"Niger",{"$f":"VLOOKUP($BQ83,'FMIS and OBD'!$C$3:$EE$200,132,FALSE)","v":0},{"$f":"VLOOKUP($BQ83,'FMIS and OBD'!$C$3:$DL$200,103,FALSE)","v":1.65},{"$f":"VLOOKUP($BQ83,'FMIS and OBD'!$C$3:$DL$200,104,FALSE)","v":1.9838709677419355}]
[null,"PI-24",9,18,2,55,8,22,7,"-",121,null,null,null,null,null,null,null,null,null,null,null,null,null,null,null,null,null,null,null,null,null,null,null,null,null,null,null,null,null,null,null,null,null,null,null,null,null,null,null,null,null,null,null,null,null,null,null,null,null,null,null,null,"South Africa","ZA",{"$f":"VLOOKUP($BL84,'FMIS and OBD'!$C$3:$EE$200,132,FALSE)","v":69.230769230769226},{"$f":"VLOOKUP($BL84,'FMIS and OBD'!$C$3:$DL$200,105,FALSE)","v":90},null,"Norway",{"$f":"VLOOKUP($BQ84,'FMIS and OBD'!$C$3:$EE$200,132,FALSE)","v":73.076923076923066},{"$f":"VLOOKUP($BQ84,'FMIS and OBD'!$C$3:$DL$200,103,FALSE)","v":3.1111111111111112},{"$f":"VLOOKUP($BQ84,'FMIS and OBD'!$C$3:$DL$200,104,FALSE)","v":3.4107142857142856}]
[null,"PI-25",10,10,"-",40,4,46,9,2,121,null,null,null,null,null,null,null,null,null,null,null,null,null,null,null,null,null,null,null,null,null,null,null,null,null,null,null,null,null,null,null,null,null,null,null,null,null,null,null,null,null,null,null,null,null,null,null,null,null,null,null,null,"Spain","ES",{"$f":"VLOOKUP($BL85,'FMIS and OBD'!$C$3:$EE$200,132,FALSE)","v":88.461538461538453},{"$f":"VLOOKUP($BL85,'FMIS and OBD'!$C$3:$DL$200,105,FALSE)","v":63},null,"Pakistan",{"$f":"VLOOKUP($BQ85,'FMIS and OBD'!$C$3:$EE$200,132,FALSE)","v":50},{"$f":"VLOOKUP($BQ85,'FMIS and OBD'!$C$3:$DL$200,103,FALSE)","v":2.8},{"$f":"VLOOKUP($BQ85,'FMIS and OBD'!$C$3:$DL$200,104,FALSE)","v":2.5499999999999998}]
[null,"PI-26","-",12,10,25,6,44,20,4,121,null,null,null,null,null,null,null,null,null,null,null,null,null,null,null,null,null,null,null,null,null,null,null,null,null,null,null,null,null,null,null,null,null,null,null,null,null,null,null,null,null,null,null,null,null,null,null,null,null,null,null,null,"Sri Lanka","LK",{"$f":"VLOOKUP($BL86,'FMIS and OBD'!$C$3:$EE$200,132,FALSE)","v":53.846153846153847},{"$f":"VLOOKUP($BL86,'FMIS and OBD'!$C$3:$DL$200,105,FALSE)","v":46},null,"Papua New Guinea",{"$f":"VLOOKUP($BQ86,'FMIS and OBD'!$C$3:$EE$200,132,FALSE)","v":42.307692307692307},{"$f":"VLOOKUP($BQ86,'FMIS and OBD'!$C$3:$DL$200,103,FALSE)","v":2.25},{"$f":"VLOOKUP($BQ86,'FMIS and OBD'!$C$3:$DL$200,104,FALSE)","v":2.2758620689655173}]
[null,"D-2",4,1,3,9,19,32,36,17,121,null,null,null,null,null,null,"FMIS Scope","Scope",null,null,null,null,null,null,null,null,null,null,null,null,null,null,null,null,null,null,null,null,null,null,null,null,null,null,null,null,null,null,null,null,null,null,null,null,null,null,null,null,null,null,null,null,"Sweden","SE",{"$f":"VLOOKUP($BL87,'FMIS and OBD'!$C$3:$EE$200,132,FALSE)","v":73.076923076923066},{"$f":"VLOOKUP($BL87,'FMIS and OBD'!$C$3:$DL$200,105,FALSE)","v":84},null,"Paraguay",{"$f":"VLOOKUP($BQ87,'FMIS and OBD'!$C$3:$EE$200,132,FALSE)","v":84.615384615384613},{"$f":"VLOOKUP($BQ87,'FMIS and OBD'!$C$3:$DL$200,103,FALSE)","v":2.25},{"$f":"VLOOKUP($BQ87,'FMIS and OBD'!$C$3:$DL$200,104,FALSE)","v":2.532258064516129}]
[null,null,null,null,null,null,null,null,null,null,null,null,null,null,null,null,null,"Central+Local",{"$f":"'FMIS and OBD'!CJ205","v":106},{"$f":"S88/S90","v":0.59887005649717517},null,null,null,null,null,null,null,null,null,null,null,null,null,null,null,null,null,null,null,null,null,null,null,null,null,null,null,null,null,null,null,null,null,null,null,null,null,null,null,null,null,null,null,"Tajikistan","TJ",{"$f":"VLOOKUP($BL88,'FMIS and OBD'!$C$3:$EE$200,132,FALSE)","v":42.307692307692307},{"$f":"VLOOKUP($BL88,'FMIS and OBD'!$C$3:$DL$200,105,FALSE)","v":17},null,"Peru",{"$f":"VLOOKUP($BQ88,'FMIS and OBD'!$C$3:$EE$200,132,FALSE)","v":92.307692307692307},{"$f":"VLOOKUP($BQ88,'FMIS and OBD'!$C$3:$DL$200,103,FALSE)","v":3.05},{"$f":"VLOOKUP($BQ88,'FMIS and OBD'!$C$3:$DL$200,104,FALSE)","v":3.1451612903225805}]
[null,null,null,null,null,null,null,null,null,null,null,null,null,null,null,null,null,"Central",{"$f":"'FMIS and OBD'!CJ204","v":71},{"$f":"S89/S90","v":0.40112994350282488},null,null,null,null,null,null,null,null,null,null,null,null,null,null,null,null,null,null,null,null,null,null,null,null,null,null,null,null,null,null,null,null,null,null,null,null,null,null,null,null,null,null,null,"Tanzania","TZ",{"$f":"VLOOKUP($BL89,'FMIS and OBD'!$C$3:$EE$200,132,FALSE)","v":57.692307692307686},{"$f":"VLOOKUP($BL89,'FMIS and OBD'!$C$3:$DL$200,105,FALSE)","v":47},null,"Philippines",{"$f":"VLOOKUP($BQ89,'FMIS and OBD'!$C$3:$EE$200,132,FALSE)","v":61.53846153846154},{"$f":"VLOOKUP($BQ89,'FMIS and OBD'!$C$3:$DL$200,103,FALSE)","v":1.45},{"$f":"VLOOKUP($BQ89,'FMIS and OBD'!$C$3:$DL$200,104,FALSE)","v":2}]
[null,"MTEF Implementation vs. FMIS & BT Grades",null,null,null,null,null,null,null,null,null,null,null,null,null,null,null,null,{"$f":"SUM(S88:S89)","v":177},null,null,null,null,null,null,null,null,null,null,null,null,null,null,null,null,null,null,null,null,null,null,null,null,null,null,null,null,null,null,null,null,null,null,null,null,null,null,null,null,null,null,null,null,"Thailand","TH",{"$f":"VLOOKUP($BL90,'FMIS and OBD'!$C$3:$EE$200,132,FALSE)","v":57.692307692307686},{"$f":"VLOOKUP($BL90,'FMIS and OBD'!$C$3:$DL$200,105,FALSE)","v":36},null,"Russian Federation",{"$f":"VLOOKUP($BQ90,'FMIS and OBD'!$C$3:$EE$200,132,FALSE)","v":80.769230769230774},{"$f":"VLOOKUP($BQ90,'FMIS and OBD'!$C$3:$DL$200,103,FALSE)","v":2.3888888888888888},{"$f":"VLOOKUP($BQ90,'FMIS and OBD'!$C$3:$DL$200,104,FALSE)","v":2.4821428571428572}]
[null,"MTEF","A","B","C","D","Sum",null,null,null,null,null,null,null,null,null,null,null,null,null,null,null,null,null,null,null,null,null,null,null,null,null,null,null,null,null,null,null,null,null,null,null,null,null,null,null,null,null,null,null,null,null,null,null,null,null,null,null,null,null,null,null,null,"Timor-Leste","TP",{"$f":"VLOOKUP($BL91,'FMIS and OBD'!$C$3:$EE$200,132,FALSE)","v":61.53846153846154},{"$f":"VLOOKUP($BL91,'FMIS and OBD'!$C$3:$DL$200,105,FALSE)","v":36},null,"Rwanda",{"$f":"VLOOKUP($BQ91,'FMIS and OBD'!$C$3:$EE$200,132,FALSE)","v":26.923076923076923},{"$f":"VLOOKUP($BQ91,'FMIS and OBD'!$C$3:$DL$200,103,FALSE)","v":2.7},{"$f":"VLOOKUP($BQ91,'FMIS and OBD'!$C$3:$DL$200,104,FALSE)","v":2.9193548387096775}]
[null,0,4,10,20,15,{"$f":"SUM(C92:F92)","v":49},null,null,null,null,null,null,null,null,null,null,null,null,null,null,null,null,null,null,null,null,null,null,null,null,null,null,null,null,null,null,null,null,null,null,null,null,null,null,null,null,null,null,null,null,null,null,null,null,null,null,null,null,null,null,null,null,"Trinidad and Tobago","TT",{"$f":"VLOOKUP($BL92,'FMIS and OBD'!$C$3:$EE$200,132,FALSE)","v":46.153846153846153},{"$f":"VLOOKUP($BL92,'FMIS and OBD'!$C$3:$DL$200,105,FALSE)","v":38},null,"Samoa",{"$f":"VLOOKUP($BQ92,'FMIS and OBD'!$C$3:$EE$200,132,FALSE)","v":30.76923076923077},{"$f":"VLOOKUP($BQ92,'FMIS and OBD'!$C$3:$DL$200,103,FALSE)","v":2},{"$f":"VLOOKUP($BQ92,'FMIS and OBD'!$C$3:$DL$200,104,FALSE)","v":2.0892857142857144}]
[null,1,9,36,18,8,71,null,null,null,null,null,null,null,null,null,null,null,null,null,null,null,null,null,null,null,null,null,null,null,null,null,null,null,null,null,null,null,null,null,null,null,null,null,null,null,null,null,null,null,null,null,null,null,null,null,null,null,null,null,null,null,null,"Tunisia","TN",{"$f":"VLOOKUP($BL93,'FMIS and OBD'!$C$3:$EE$200,132,FALSE)","v":34.615384615384613},{"$f":"VLOOKUP($BL93,'FMIS and OBD'!$C$3:$DL$200,105,FALSE)","v":11},null,"São Tomé and Principe",{"$f":"VLOOKUP($BQ93,'FMIS and OBD'!$C$3:$EE$200,132,FALSE)","v":0},{"$f":"VLOOKUP($BQ93,'FMIS and OBD'!$C$3:$DL$200,103,FALSE)","v":1.55},{"$f":"VLOOKUP($BQ93,'FMIS and OBD'!$C$3:$DL$200,104,FALSE)","v":1.7666666666666666}]
[null,2,7,22,10,3,42,null,null,null,null,null,null,null,null,null,null,null,null,null,null,null,null,null,null,null,null,null,null,null,null,null,null,null,null,null,null,null,null,null,null,null,null,null,null,null,null,null,null,null,null,null,null,null,null,null,null,null,null,null,null,null,null,"Turkey","TR",{"$f":"VLOOKUP($BL94,'FMIS and OBD'!$C$3:$EE$200,132,FALSE)","v":88.461538461538453},{"$f":"VLOOKUP($BL94,'FMIS and OBD'!$C$3:$DL$200,105,FALSE)","v":50},null,"Senegal",{"$f":"VLOOKUP($BQ94,'FMIS and OBD'!$C$3:$EE$200,132,FALSE)","v":38.461538461538467},{"$f":"VLOOKUP($BQ94,'FMIS and OBD'!$C$3:$DL$200,103,FALSE)","v":2.15},{"$f":"VLOOKUP($BQ94,'FMIS and OBD'!$C$3:$DL$200,104,FALSE)","v":2.1774193548387095}]
[null,3,7,12,null,null,19,null,null,null,null,null,null,null,null,null,null,null,null,null,null,null,null,null,null,null,null,null,null,null,null,null,null,null,null,null,null,null,null,null,null,null,null,null,null,null,null,null,null,null,null,null,null,null,null,null,null,null,null,null,null,null,null,"Uganda","UG",{"$f":"VLOOKUP($BL95,'FMIS and OBD'!$C$3:$EE$200,132,FALSE)","v":57.692307692307686},{"$f":"VLOOKUP($BL95,'FMIS and OBD'!$C$3:$DL$200,105,FALSE)","v":65},null,"Serbia",{"$f":"VLOOKUP($BQ95,'FMIS and OBD'!$C$3:$EE$200,132,FALSE)","v":61.53846153846154},{"$f":"VLOOKUP($BQ95,'FMIS and OBD'!$C$3:$DL$200,103,FALSE)","v":3.1},{"$f":"VLOOKUP($BQ95,'FMIS and OBD'!$C$3:$DL$200,104,FALSE)","v":2.7903225806451615}]
[null,"-",null,1,6,10,17,null,null,null,null,null,null,null,null,null,null,"FMIS ASW","ASW",null,null,null,null,null,null,null,null,null,null,null,null,null,null,null,null,null,null,null,null,null,null,null,null,null,null,null,null,null,null,null,null,null,null,null,null,null,null,null,null,null,null,null,null,"Ukraine","UA",{"$f":"VLOOKUP($BL96,'FMIS and OBD'!$C$3:$EE$200,132,FALSE)","v":61.53846153846154},{"$f":"VLOOKUP($BL96,'FMIS and OBD'!$C$3:$DL$200,105,FALSE)","v":54},null,"Seychelles",{"$f":"VLOOKUP($BQ96,'FMIS and OBD'!$C$3:$EE$200,132,FALSE)","v":0},{"$f":"VLOOKUP($BQ96,'FMIS and OBD'!$C$3:$DL$200,103,FALSE)","v":2.4500000000000002},{"$f":"VLOOKUP($BQ96,'FMIS and OBD'!$C$3:$DL$200,104,FALSE)","v":2.5333333333333332}]
[null,"Sum",{"$f":"SUM(C92:C96)","v":27},81,54,36,{"$f":"SUM(G92:G96)","v":198},null,null,null,null,null,null,null,null,null,null,"COTS",{"$f":"'FMIS and OBD'!CL204","v":96},{"$f":"S97/S100","v":0.5423728813559322},null,null,null,null,null,null,null,null,null,null,null,null,null,null,null,null,null,null,null,null,null,null,null,null,null,null,null,null,null,null,null,null,null,null,null,null,null,null,null,null,null,null,null,"United Kingdom","UK",{"$f":"VLOOKUP($BL97,'FMIS and OBD'!$C$3:$EE$200,132,FALSE)","v":88.461538461538453},{"$f":"VLOOKUP($BL97,'FMIS and OBD'!$C$3:$DL$200,105,FALSE)","v":88},null,"Sierra Leone",{"$f":"VLOOKUP($BQ97,'FMIS and OBD'!$C$3:$EE$200,132,FALSE)","v":30.76923076923077},{"$f":"VLOOKUP($BQ97,'FMIS and OBD'!$C$3:$DL$200,103,FALSE)","v":2.75},{"$f":"VLOOKUP($BQ97,'FMIS and OBD'!$C$3:$DL$200,104,FALSE)","v":2.35}]
[null,null,null,null,null,null,null,null,null,null,null,null,null,null,null,null,null,"LDSW",{"$f":"'FMIS and OBD'!CL205","v":69},{"$f":"S98/S100","v":0.38983050847457629},null,null,null,null,null,null,null,null,null,null,null,null,null,null,null,null,null,null,null,null,null,null,null,null,null,null,null,null,null,null,null,null,null,null,null,null,null,null,null,null,null,null,null,"United States of America","US",{"$f":"VLOOKUP($BL98,'FMIS and OBD'!$C$3:$EE$200,132,FALSE)","v":88.461538461538453},{"$f":"VLOOKUP($BL98,'FMIS and OBD'!$C$3:$DL$200,105,FALSE)","v":79},null,"Solomon Islands",{"$f":"VLOOKUP($BQ98,'FMIS and OBD'!$C$3:$EE$200,132,FALSE)","v":50},{"$f":"VLOOKUP($BQ98,'FMIS and OBD'!$C$3:$DL$200,103,FALSE)","v":2},{"$f":"VLOOKUP($BQ98,'FMIS and OBD'!$C$3:$DL$200,104,FALSE)","v":1.8333333333333333}]
[null,null,null,null,null,null,null,null,null,null,null,null,null,null,null,null,null,"Unknown",{"$f":"'FMIS and OBD'!CL206","v":12},{"$f":"S99/S100","v":6.7796610169491525E-2},null,null,null,null,null,null,null,null,null,null,null,null,null,null,null,null,null,null,null,null,null,null,null,null,null,null,null,null,null,null,null,null,null,null,null,null,null,null,null,null,null,null,null,"Venezuela, RB","VE",{"$f":"VLOOKUP($BL99,'FMIS and OBD'!$C$3:$EE$200,132,FALSE)","v":53.846153846153847},{"$f":"VLOOKUP($BL99,'FMIS and OBD'!$C$3:$DL$200,105,FALSE)","v":37},null,"South Africa",{"$f":"VLOOKUP($BQ99,'FMIS and OBD'!$C$3:$EE$200,132,FALSE)","v":69.230769230769226},{"$f":"VLOOKUP($BQ99,'FMIS and OBD'!$C$3:$DL$200,103,FALSE)","v":3.35},{"$f":"VLOOKUP($BQ99,'FMIS and OBD'!$C$3:$DL$200,104,FALSE)","v":3.3225806451612905}]
[null,"Open Government Partnership vs. FMIS & BT Grades",null,null,null,null,null,null,null,null,null,null,null,null,null,null,null,null,{"$f":"SUM(S97:S99)","v":177},null,null,null,null,null,null,null,null,null,null,null,null,null,null,null,null,null,null,null,null,null,null,null,null,null,null,null,null,null,null,null,null,null,null,null,null,null,null,null,null,null,null,null,null,"Vietnam","VN",{"$f":"VLOOKUP($BL100,'FMIS and OBD'!$C$3:$EE$200,132,FALSE)","v":61.53846153846154},{"$f":"VLOOKUP($BL100,'FMIS and OBD'!$C$3:$DL$200,105,FALSE)","v":19},null,"South Sudan",{"$f":"VLOOKUP($BQ100,'FMIS and OBD'!$C$3:$EE$200,132,FALSE)","v":23.076923076923077},{"$f":"VLOOKUP($BQ100,'FMIS and OBD'!$C$3:$DL$200,103,FALSE)","v":1.9},{"$f":"VLOOKUP($BQ100,'FMIS and OBD'!$C$3:$DL$200,104,FALSE)","v":1.7413793103448276}]
[null,"OGP","A","B","C","D","Sum",null,null,null,null,null,null,null,null,null,null,null,null,null,null,null,null,null,null,null,null,null,null,null,null,null,null,null,null,null,null,null,null,null,null,null,null,null,null,null,null,null,null,null,null,null,null,null,null,null,null,null,null,null,null,null,null,"Yemen","YE",{"$f":"VLOOKUP($BL101,'FMIS and OBD'!$C$3:$EE$200,132,FALSE)","v":34.615384615384613},{"$f":"VLOOKUP($BL101,'FMIS and OBD'!$C$3:$DL$200,105,FALSE)","v":11},null,"St. Kitts and Nevis",{"$f":"VLOOKUP($BQ101,'FMIS and OBD'!$C$3:$EE$200,132,FALSE)","v":3.8461538461538463},{"$f":"VLOOKUP($BQ101,'FMIS and OBD'!$C$3:$DL$200,103,FALSE)","v":2.15},{"$f":"VLOOKUP($BQ101,'FMIS and OBD'!$C$3:$DL$200,104,FALSE)","v":2.25}]
[null,0,2,null,3,null,{"$f":"SUM(C102:F102)","v":5},null,null,null,null,null,null,null,null,null,null,null,null,null,null,null,null,null,null,null,null,null,null,null,null,null,null,null,null,null,null,null,null,null,null,null,null,null,null,null,null,null,null,null,null,null,null,null,null,null,null,null,null,null,null,null,null,"Zambia","ZM",{"$f":"VLOOKUP($BL102,'FMIS and OBD'!$C$3:$EE$200,132,FALSE)","v":50},{"$f":"VLOOKUP($BL102,'FMIS and OBD'!$C$3:$DL$200,105,FALSE)","v":4},null,"St. Lucia",{"$f":"VLOOKUP($BQ102,'FMIS and OBD'!$C$3:$EE$200,132,FALSE)","v":26.923076923076923},{"$f":"VLOOKUP($BQ102,'FMIS and OBD'!$C$3:$DL$200,103,FALSE)","v":1.8},{"$f":"VLOOKUP($BQ102,'FMIS and OBD'!$C$3:$DL$200,104,FALSE)","v":2.225806451612903}]
[null,1,14,33,7,1,55,null,null,null,null,null,null,null,null,null,null,null,null,null,null,null,null,null,null,null,null,null,null,null,null,null,null,null,null,null,null,null,null,null,null,null,null,null,null,null,null,null,null,null,null,null,null,null,null,null,null,null,null,null,null,null,null,"Zimbabwe","ZW",{"$f":"VLOOKUP($BL103,'FMIS and OBD'!$C$3:$EE$200,132,FALSE)","v":38.461538461538467},{"$f":"VLOOKUP($BL103,'FMIS and OBD'!$C$3:$DL$200,105,FALSE)","v":20},null,"St. Vincent and the Grenadines",{"$f":"VLOOKUP($BQ103,'FMIS and OBD'!$C$3:$EE$200,132,FALSE)","v":19.230769230769234},{"$f":"VLOOKUP($BQ103,'FMIS and OBD'!$C$3:$DL$200,103,FALSE)","v":2.3125},{"$f":"VLOOKUP($BQ103,'FMIS and OBD'!$C$3:$DL$200,104,FALSE)","v":2.6666666666666665}]
[null,"Sum",{"$f":"SUM(C102:C103)","v":16},{"$f":"SUM(D102:D103)","v":33},{"$f":"SUM(E102:E103)","v":10},{"$f":"SUM(F102:F103)","v":1},{"$f":"SUM(G102:G103)","v":60},null,null,null,null,null,null,null,null,null,null,null,null,null,null,null,null,null,null,null,null,null,null,null,null,null,null,null,null,null,null,null,null,null,null,null,null,null,null,null,null,null,null,null,null,null,null,null,null,null,null,null,null,null,null,null,null,null,null,null,null,null,"Sudan",{"$f":"VLOOKUP($BQ104,'FMIS and OBD'!$C$3:$EE$200,132,FALSE)","v":15.384615384615385},{"$f":"VLOOKUP($BQ104,'FMIS and OBD'!$C$3:$DL$200,103,FALSE)","v":1.8},{"$f":"VLOOKUP($BQ104,'FMIS and OBD'!$C$3:$DL$200,104,FALSE)","v":1.7407407407407407}]
[null,null,null,null,null,null,null,null,null,null,null,null,null,null,null,null,null,"FMIS Arch","Tech Arch",null,null,null,null,null,null,null,null,null,null,null,null,null,null,null,null,null,null,null,null,null,null,null,null,null,null,null,null,null,null,null,null,null,null,null,null,null,null,null,null,null,null,null,null,null,null,null,null,null,"Suriname",{"$f":"VLOOKUP($BQ105,'FMIS and OBD'!$C$3:$EE$200,132,FALSE)","v":11.538461538461538},{"$f":"VLOOKUP($BQ105,'FMIS and OBD'!$C$3:$DL$200,103,FALSE)","v":1.65},{"$f":"VLOOKUP($BQ105,'FMIS and OBD'!$C$3:$DL$200,104,FALSE)","v":1.75}]
[null,null,null,null,null,null,null,null,null,null,null,null,null,null,null,null,null,"Web-based",{"$f":"'FMIS and OBD'!CN204","v":150},{"$f":"S106/S108","v":0.84745762711864403},null,null,null,null,null,null,null,null,null,null,null,null,null,null,null,null,null,null,null,null,null,null,null,null,null,null,null,null,null,null,null,null,null,null,null,null,null,null,null,null,null,null,null,null,null,null,null,null,"Swaziland",{"$f":"VLOOKUP($BQ106,'FMIS and OBD'!$C$3:$EE$200,132,FALSE)","v":34.615384615384613},{"$f":"VLOOKUP($BQ106,'FMIS and OBD'!$C$3:$DL$200,103,FALSE)","v":2.2777777777777777},{"$f":"VLOOKUP($BQ106,'FMIS and OBD'!$C$3:$DL$200,104,FALSE)","v":2.25}]
[null,"UN e-Government Dev Rankings 2012 vs. FMIS & BT Grades",null,null,null,null,null,null,null,null,null,null,null,null,null,null,null,"Client-server",{"$f":"'FMIS and OBD'!CN205","v":27},{"$f":"S107/S108","v":0.15254237288135594},null,null,null,null,null,null,null,null,null,null,null,null,null,null,null,null,null,null,null,null,null,null,null,null,null,null,null,null,null,null,null,null,null,null,null,null,null,null,null,null,null,null,null,null,null,null,null,null,"Syrian Arab Republic",{"$f":"VLOOKUP($BQ107,'FMIS and OBD'!$C$3:$EE$200,132,FALSE)","v":3.8461538461538463},{"$f":"VLOOKUP($BQ107,'FMIS and OBD'!$C$3:$DL$200,103,FALSE)","v":1.7222222222222223},{"$f":"VLOOKUP($BQ107,'FMIS and OBD'!$C$3:$DL$200,104,FALSE)","v":2}]
[null,"eGov","A","B","C","D","Sum",null,null,null,null,null,null,null,null,null,null,null,{"$f":"SUM(S106:S107)","v":177},null,null,null,null,null,null,null,null,null,null,null,null,null,null,null,null,null,null,null,null,null,null,null,null,null,null,null,null,null,null,null,null,null,null,null,null,null,null,null,null,null,null,null,null,null,null,null,null,null,"Tajikistan",{"$f":"VLOOKUP($BQ108,'FMIS and OBD'!$C$3:$EE$200,132,FALSE)","v":42.307692307692307},{"$f":"VLOOKUP($BQ108,'FMIS and OBD'!$C$3:$DL$200,103,FALSE)","v":1.95},{"$f":"VLOOKUP($BQ108,'FMIS and OBD'!$C$3:$DL$200,104,FALSE)","v":2.0666666666666669}]
[null,"1-40",13,23,2,2,{"$f":"SUM(C109:F109)","v":40},null,null,null,null,null,null,null,null,null,null,null,null,null,null,null,null,null,null,null,null,null,null,null,null,null,null,null,null,null,null,null,null,null,null,null,null,null,null,null,null,null,null,null,null,null,null,null,null,null,null,null,null,null,null,null,null,null,null,null,null,null,"Tanzania",{"$f":"VLOOKUP($BQ109,'FMIS and OBD'!$C$3:$EE$200,132,FALSE)","v":57.692307692307686},{"$f":"VLOOKUP($BQ109,'FMIS and OBD'!$C$3:$DL$200,103,FALSE)","v":2.6111111111111112},{"$f":"VLOOKUP($BQ109,'FMIS and OBD'!$C$3:$DL$200,104,FALSE)","v":2.4423076923076925}]
[null,"41-80",7,18,12,3,{"$f":"SUM(C110:F110)","v":40},null,null,null,null,null,null,null,null,null,null,null,null,null,null,null,null,null,null,null,null,null,null,null,null,null,null,null,null,null,null,null,null,null,null,null,null,null,null,null,null,null,null,null,null,null,null,null,null,null,null,null,null,null,null,null,null,null,null,null,null,null,"Thailand",{"$f":"VLOOKUP($BQ110,'FMIS and OBD'!$C$3:$EE$200,132,FALSE)","v":57.692307692307686},{"$f":"VLOOKUP($BQ110,'FMIS and OBD'!$C$3:$DL$200,103,FALSE)","v":2.8333333333333335},{"$f":"VLOOKUP($BQ110,'FMIS and OBD'!$C$3:$DL$200,104,FALSE)","v":3.125}]
[null,"81-120",5,18,10,7,40,null,null,null,null,null,null,null,null,null,null,null,null,null,null,null,null,null,null,null,null,null,null,null,null,null,null,null,null,null,null,null,null,null,null,null,null,null,null,null,null,null,null,null,null,null,null,null,null,null,null,null,null,null,null,null,null,null,null,null,null,null,"Timor-Leste",{"$f":"VLOOKUP($BQ111,'FMIS and OBD'!$C$3:$EE$200,132,FALSE)","v":61.53846153846154},{"$f":"VLOOKUP($BQ111,'FMIS and OBD'!$C$3:$DL$200,103,FALSE)","v":2.4500000000000002},{"$f":"VLOOKUP($BQ111,'FMIS and OBD'!$C$3:$DL$200,104,FALSE)","v":2.0862068965517242}]
[null,"121-160",2,13,15,10,40,null,null,null,null,null,null,null,null,null,null,"FMIS Application Software",null,null,null,null,null,null,null,null,null,null,null,null,null,null,null,null,null,null,null,null,null,null,null,null,null,null,null,null,null,null,null,null,null,null,null,null,null,null,null,null,null,null,null,null,null,null,null,null,null,null,"Togo",{"$f":"VLOOKUP($BQ112,'FMIS and OBD'!$C$3:$EE$200,132,FALSE)","v":3.8461538461538463},{"$f":"VLOOKUP($BQ112,'FMIS and OBD'!$C$3:$DL$200,103,FALSE)","v":1.2777777777777777},{"$f":"VLOOKUP($BQ112,'FMIS and OBD'!$C$3:$DL$200,104,FALSE)","v":1.5925925925925926}]
[null,"161-190",null,6,13,11,30,null,null,null,null,null,null,null,null,null,null,"(Central Government)",null,null,null,null,null,null,null,null,null,null,null,null,null,null,null,null,null,null,null,null,null,null,null,null,null,null,null,null,null,null,null,null,null,null,null,null,null,null,null,null,null,null,null,null,null,null,null,null,null,null,"Tonga",{"$f":"VLOOKUP($BQ113,'FMIS and OBD'!$C$3:$EE$200,132,FALSE)","v":50},{"$f":"VLOOKUP($BQ113,'FMIS and OBD'!$C$3:$DL$200,103,FALSE)","v":2.0499999999999998},{"$f":"VLOOKUP($BQ113,'FMIS and OBD'!$C$3:$DL$200,104,FALSE)","v":2.6071428571428572}]
[null,"Sum",{"$f":"SUM(C109:C113)","v":27},78,52,33,{"$f":"SUM(G109:G113)","v":190},null,null,null,null,null,null,null,null,null,null,"Commercial Packages",null,null,null,null,null,null,null,null,null,null,null,null,null,null,null,null,null,null,null,null,null,null,null,null,null,null,null,null,null,null,null,null,null,null,null,null,null,null,null,null,null,null,null,null,null,null,null,null,null,null,"Trinidad and Tobago",{"$f":"VLOOKUP($BQ114,'FMIS and OBD'!$C$3:$EE$200,132,FALSE)","v":46.153846153846153},{"$f":"VLOOKUP($BQ114,'FMIS and OBD'!$C$3:$DL$200,103,FALSE)","v":2.5},{"$f":"VLOOKUP($BQ114,'FMIS and OBD'!$C$3:$DL$200,104,FALSE)","v":2.6666666666666665}]
[null,null,null,null,null,null,null,null,null,null,null,null,null,null,null,null,null,"SAP",33,null,null,null,null,null,null,null,null,null,null,null,null,null,null,null,null,null,null,null,null,null,null,null,null,null,null,null,null,null,null,null,null,null,null,null,null,null,null,null,null,null,null,null,null,null,null,null,null,null,"Tunisia",{"$f":"VLOOKUP($BQ115,'FMIS and OBD'!$C$3:$EE$200,132,FALSE)","v":34.615384615384613},{"$f":"VLOOKUP($BQ115,'FMIS and OBD'!$C$3:$DL$200,103,FALSE)","v":2.85},{"$f":"VLOOKUP($BQ115,'FMIS and OBD'!$C$3:$DL$200,104,FALSE)","v":3.0483870967741935}]
[null,"UN e-Government Development Index 2012",null,null,null,null,null,null,null,null,null,null,null,null,null,null,null,"Oracle",26,null,null,null,null,null,null,null,null,null,null,null,null,null,null,null,null,null,null,null,null,null,null,null,null,null,null,null,null,null,null,null,null,null,null,null,null,null,null,null,null,null,null,null,null,null,null,null,null,null,"Turkey",{"$f":"VLOOKUP($BQ116,'FMIS and OBD'!$C$3:$EE$200,132,FALSE)","v":88.461538461538453},{"$f":"VLOOKUP($BQ116,'FMIS and OBD'!$C$3:$DL$200,103,FALSE)","v":3.2222222222222223},{"$f":"VLOOKUP($BQ116,'FMIS and OBD'!$C$3:$DL$200,104,FALSE)","v":3.0535714285714284}]
[null,"eGov","A","B","C","D","Sum",null,null,null,null,null,null,null,null,null,null,"Free Balance",12,null,null,null,null,null,null,null,null,null,null,null,null,null,null,null,null,null,null,null,null,null,null,null,null,null,null,null,null,null,null,null,null,null,null,null,null,null,null,null,null,null,null,null,null,null,null,null,null,null,"Tuvalu",{"$f":"VLOOKUP($BQ117,'FMIS and OBD'!$C$3:$EE$200,132,FALSE)","v":3.8461538461538463},{"$f":"VLOOKUP($BQ117,'FMIS and OBD'!$C$3:$DL$200,103,FALSE)","v":2.15},{"$f":"VLOOKUP($BQ117,'FMIS and OBD'!$C$3:$DL$200,104,FALSE)","v":2.1129032258064515}]
[null,"0.00-0.2",null,3,3,4,{"$f":"SUM(C118:F118)","v":10},null,null,null,null,null,null,null,null,null,null,"Smart Stream",7,null,null,null,null,null,null,null,null,null,null,null,null,null,null,null,null,null,null,null,null,null,null,null,null,null,null,null,null,null,null,null,null,null,null,null,null,null,null,null,null,null,null,null,null,null,null,null,null,null,"Uganda",{"$f":"VLOOKUP($BQ118,'FMIS and OBD'!$C$3:$EE$200,132,FALSE)","v":57.692307692307686},{"$f":"VLOOKUP($BQ118,'FMIS and OBD'!$C$3:$DL$200,103,FALSE)","v":2.9},{"$f":"VLOOKUP($BQ118,'FMIS and OBD'!$C$3:$DL$200,104,FALSE)","v":2.370967741935484}]
[null,"0.21-0.4",2,16,23,17,{"$f":"SUM(C119:F119)","v":58},null,null,null,null,null,null,null,null,null,null,"Epicor",4,null,null,null,null,null,null,null,null,null,null,null,null,null,null,null,null,null,null,null,null,null,null,null,null,null,null,null,null,null,null,null,null,null,null,null,null,null,null,null,null,null,null,null,null,null,null,null,null,null,"Ukraine",{"$f":"VLOOKUP($BQ119,'FMIS and OBD'!$C$3:$EE$200,132,FALSE)","v":61.53846153846154},{"$f":"VLOOKUP($BQ119,'FMIS and OBD'!$C$3:$DL$200,103,FALSE)","v":2.95},{"$f":"VLOOKUP($BQ119,'FMIS and OBD'!$C$3:$DL$200,104,FALSE)","v":2.56}]
[null,"0.41-0.6",7,29,17,7,{"$f":"SUM(C120:F120)","v":60},null,null,null,null,null,null,null,null,null,null,"MS Dynamics",3,null,null,null,null,null,null,null,null,null,null,null,null,null,null,null,null,null,null,null,null,null,null,null,null,null,null,null,null,null,null,null,null,null,null,null,null,null,null,null,null,null,null,null,null,null,null,null,null,null,"Vanuatu",{"$f":"VLOOKUP($BQ120,'FMIS and OBD'!$C$3:$EE$200,132,FALSE)","v":19.230769230769234},{"$f":"VLOOKUP($BQ120,'FMIS and OBD'!$C$3:$DL$200,103,FALSE)","v":2.5499999999999998},{"$f":"VLOOKUP($BQ120,'FMIS and OBD'!$C$3:$DL$200,104,FALSE)","v":2.564516129032258}]
[null,"0.61-0.8",9,22,8,4,{"$f":"SUM(C121:F121)","v":43},null,null,null,null,null,null,null,null,null,null,"Other",11,null,null,null,null,null,null,null,null,null,null,null,null,null,null,null,null,null,null,null,null,null,null,null,null,null,null,null,null,null,null,null,null,null,null,null,null,null,null,null,null,null,null,null,null,null,null,null,null,null,"West Bank and Gaza",{"$f":"VLOOKUP($BQ121,'FMIS and OBD'!$C$3:$EE$200,132,FALSE)","v":46.153846153846153},{"$f":"VLOOKUP($BQ121,'FMIS and OBD'!$C$3:$DL$200,103,FALSE)","v":1.75},{"$f":"VLOOKUP($BQ121,'FMIS and OBD'!$C$3:$DL$200,104,FALSE)","v":1.8888888888888888}]
[null,"0.81-1.0",9,8,1,1,{"$f":"SUM(C122:F122)","v":19},null,null,null,null,null,null,null,null,null,null,null,{"$f":"SUM(S115:S121)","v":96},null,null,null,null,null,null,null,null,null,null,null,null,null,null,null,null,null,null,null,null,null,null,null,null,null,null,null,null,null,null,null,null,null,null,null,null,null,null,null,null,null,null,null,null,null,null,null,null,null,"Yemen",{"$f":"VLOOKUP($BQ122,'FMIS and OBD'!$C$3:$EE$200,132,FALSE)","v":34.615384615384613},{"$f":"VLOOKUP($BQ122,'FMIS and OBD'!$C$3:$DL$200,103,FALSE)","v":2.6},{"$f":"VLOOKUP($BQ122,'FMIS and OBD'!$C$3:$DL$200,104,FALSE)","v":2.3833333333333333}]
[null,"Sum",{"$f":"SUM(C118:C122)","v":27},{"$f":"SUM(D118:D122)","v":78},{"$f":"SUM(E118:E122)","v":52},{"$f":"SUM(F118:F122)","v":33},{"$f":"SUM(G118:G122)","v":190},null,null,null,null,null,null,null,null,null,null,null,null,null,null,null,null,null,null,null,null,null,null,null,null,null,null,null,null,null,null,null,null,null,null,null,null,null,null,null,null,null,null,null,null,null,null,null,null,null,null,null,null,null,null,null,null,null,null,null,null,null,"Zambia",{"$f":"VLOOKUP($BQ123,'FMIS and OBD'!$C$3:$EE$200,132,FALSE)","v":50},{"$f":"VLOOKUP($BQ123,'FMIS and OBD'!$C$3:$DL$200,103,FALSE)","v":2.95},{"$f":"VLOOKUP($BQ123,'FMIS and OBD'!$C$3:$DL$200,104,FALSE)","v":2.5}]
[null,null,null,null,null,null,null,null,null,null,null,null,null,null,null,null,null,"Locally Developed SW",null,null,null,null,null,null,null,null,null,null,null,null,null,null,null,null,null,null,null,null,null,null,null,null,null,null,null,null,null,null,null,null,null,null,null,null,null,null,null,null,null,null,null,null,null,null,null,null,null,null,"Zimbabwe",{"$f":"VLOOKUP($BQ124,'FMIS and OBD'!$C$3:$EE$200,132,FALSE)","v":38.461538461538467},{"$f":"VLOOKUP($BQ124,'FMIS and OBD'!$C$3:$DL$200,103,FALSE)","v":2.4500000000000002},{"$f":"VLOOKUP($BQ124,'FMIS and OBD'!$C$3:$DL$200,104,FALSE)","v":2.2000000000000002}]
[null,"e-Gov Online Services",null,null,null,null,null,null,null,null,null,null,null,null,null,null,null,"LDSW > Ora DB",34]
[null,"eGov","A","B","C","D","Sum",null,null,null,null,null,null,null,null,null,null,"LDSW > MS SQL",7]
[null,"0.00-0.2",null,4,10,19,{"$f":"SUM(C127:F127)","v":33},null,null,null,null,null,null,null,null,null,null,"LDSW + OSS",3]
[null,"0.21-0.4",1,20,29,10,{"$f":"SUM(C128:F128)","v":60},null,null,null,null,null,null,null,null,null,null,"LDSW",25]
[null,"0.41-0.6",9,32,10,3,{"$f":"SUM(C129:F129)","v":54},null,null,null,null,null,null,null,null,null,null,null,{"$f":"SUM(S125:S128)","v":69}]
[null,"0.61-0.8",9,12,3,1,{"$f":"SUM(C130:F130)","v":25}]
[null,"0.81-1.0",8,10,null,null,{"$f":"SUM(C131:F131)","v":18},null,null,null,null,null,null,null,null,null,null,"Unknown",12]
[null,"Sum",{"$f":"SUM(C127:C131)","v":27},{"$f":"SUM(D127:D131)","v":78},{"$f":"SUM(E127:E131)","v":52},{"$f":"SUM(F127:F131)","v":33},{"$f":"SUM(G127:G131)","v":190}]
[null,null,null,null,null,null,null,null,null,null,null,null,null,null,null,null,null,"No FMIS yet",21]
[null,"e-Gov Telecommunications Infrastructure"]
[null,"eGov","A","B","C","D","Sum",null,null,null,null,null,null,null,null,null,null,"Total",{"$f":"S122+S129+S131+S133","v":198}]
[null,"0.00-0.2",4,24,29,22,{"$f":"SUM(C136:F136)","v":79}]
[null,"0.21-0.4",8,23,9,3,{"$f":"SUM(C137:F137)","v":43}]
[null,"0.41-0.6",3,14,9,5,{"$f":"SUM(C138:F138)","v":31}]
[null,"0.61-0.8",9,13,4,1,{"$f":"SUM(C139:F139)","v":27}]
[null,"0.81-1.0",3,4,1,2,{"$f":"SUM(C140:F140)","v":10}]
[null,"Sum",{"$f":"SUM(C136:C140)","v":27},{"$f":"SUM(D136:D140)","v":78},{"$f":"SUM(E136:E140)","v":52},{"$f":"SUM(F136:F140)","v":33},{"$f":"SUM(G136:G140)","v":190}]
[]
[null,"e-Gov Human Capital Development"]
[null,"eGov","A","B","C","D","Sum"]
[null,"0.00-0.2",null,1,null,3,{"$f":"SUM(C145:F145)","v":4}]
[null,"0.21-0.4",null,3,7,3,{"$f":"SUM(C146:F146)","v":13}]
[null,"0.41-0.6",1,13,11,6,{"$f":"SUM(C147:F147)","v":31}]
[null,"0.61-0.8",7,20,15,10,{"$f":"SUM(C148:F148)","v":52}]
[null,"0.81-1.0",19,41,19,11,{"$f":"SUM(C149:F149)","v":90}]
[null,"Sum",{"$f":"SUM(C145:C149)","v":27},{"$f":"SUM(D145:D149)","v":78},{"$f":"SUM(E145:E149)","v":52},{"$f":"SUM(F145:F149)","v":33},{"$f":"SUM(G145:G149)","v":190}]
[]
[]
[]
[null,"Open Source Policies"]
[null,"OSP","R","A","P","M","Sum"]
[null,"National",69,66,60,32,{"$f":"SUM(C156:F156)","v":227}]
[null,"State/Local",25,19,52,21,{"$f":"SUM(C157:F157)","v":117}]
[null,"Int'l",5,12,1,0,{"$f":"SUM(C158:F158)","v":18}]
[null,"Sum",{"$f":"SUM(C156:C158)","v":99},{"$f":"SUM(D156:D158)","v":97},113,53,362]
[]
[null,"Open Source Policies vs. FMIS & BT Grades"]
[null,"OSP","A","B","C","D","Sum"]
[null,"Central",22,38,4,2,{"$f":"SUM(C163:F163)","v":66}]
[null,"Local",10,12,"-","-",22]

{"sheet":"Good Practice cases","index":2,"n_rows":55,"n_cols":15,"rows_kept":55,"cut":false,"hidden":false,"merged":[]}
["#","1. Timely publication","2. Visibility of FMIS","3. \u0084Dynamic query options","4. Open budget data","5. Reliability of PF data","6. Presentation quality","7. Effective use of open data",null,"#","Economy","# of cases","Income","Region","Group"]
[1,"Mauritius","Madagascar","China","Australia","Gambia","Australia","Korea, Rep.",null,{"$f":"ROW()-1","v":1},"Argentina",{"$f":"COUNTIF($B$2:$H$19,K2)","v":4},{"$f":"VLOOKUP($K2,'FMIS and OBD'!$C$3:$EE$200,2,FALSE)","v":"UMIC"},{"$f":"VLOOKUP($K2,'FMIS and OBD'!$C$3:$EE$200,114,FALSE)","v":"LCR"},{"$f":"VLOOKUP($K2,'FMIS and OBD'!$C$3:$EE$200,133,FALSE)","v":"A"}]
[2,"Australia","Australia","Timor-Leste","Korea, Rep.","Zambia","Korea, Rep.","Philippines",null,{"$f":"ROW()-1","v":2},"Australia",{"$f":"COUNTIF($B$2:$H$19,K3)","v":4},{"$f":"VLOOKUP($K3,'FMIS and OBD'!$C$3:$EE$200,2,FALSE)","v":"HIC"},"EAP",{"$f":"VLOOKUP($K3,'FMIS and OBD'!$C$3:$EE$200,133,FALSE)","v":"A"}]
[3,"Japan","Indonesia","Denmark","Chinese Taipei (Taiwan)","Korea, Rep.","New Zealand","Singapore",null,3,"Austria",1,{"$f":"VLOOKUP($K4,'FMIS and OBD'!$C$3:$EE$200,2,FALSE)","v":"HIC"},"ECA",{"$f":"VLOOKUP($K4,'FMIS and OBD'!$C$3:$EE$200,133,FALSE)","v":"B"}]
[4,"Korea, Rep.","Korea, Rep.","Estonia","Viet Nam","Thailand","Philippines","Germany",null,4,"Bolivia",3,{"$f":"VLOOKUP($K5,'FMIS and OBD'!$C$3:$EE$200,2,FALSE)","v":"LMIC"},{"$f":"VLOOKUP($K5,'FMIS and OBD'!$C$3:$EE$200,114,FALSE)","v":"LCR"},{"$f":"VLOOKUP($K5,'FMIS and OBD'!$C$3:$EE$200,133,FALSE)","v":"B"}]
[5,"New Zealand","Malaysia","Netherlands","Ireland","Slovenia","Singapore","Norway",null,5,"Brazil",7,{"$f":"VLOOKUP($K6,'FMIS and OBD'!$C$3:$EE$200,2,FALSE)","v":"UMIC"},{"$f":"VLOOKUP($K6,'FMIS and OBD'!$C$3:$EE$200,114,FALSE)","v":"LCR"},{"$f":"VLOOKUP($K6,'FMIS and OBD'!$C$3:$EE$200,133,FALSE)","v":"A"}]
[6,"Singapore","France","Turkey","Netherlands","Bolivia","Austria","Russian Federation",null,6,"Chile",4,{"$f":"VLOOKUP($K7,'FMIS and OBD'!$C$3:$EE$200,2,FALSE)","v":"UMIC"},{"$f":"VLOOKUP($K7,'FMIS and OBD'!$C$3:$EE$200,114,FALSE)","v":"LCR"},{"$f":"VLOOKUP($K7,'FMIS and OBD'!$C$3:$EE$200,133,FALSE)","v":"B"}]
[7,"France","Russian Federation","Argentina","Norway","Brazil","Finland","Turkey",null,7,"China",1,{"$f":"VLOOKUP($K8,'FMIS and OBD'!$C$3:$EE$200,2,FALSE)","v":"UMIC"},{"$f":"VLOOKUP($K8,'FMIS and OBD'!$C$3:$EE$200,114,FALSE)","v":"EAP"},{"$f":"VLOOKUP($K8,'FMIS and OBD'!$C$3:$EE$200,133,FALSE)","v":"B"}]
[8,"Germany","United Kingdom","Bolivia","United Kingdom","Dominican Republic","Russian Federation","United Kingdom",null,8,"Chinese Taipei (Taiwan)",1,{"$f":"VLOOKUP($K9,'FMIS and OBD'!$C$3:$EE$200,2,FALSE)","v":"HIC"},{"$f":"VLOOKUP($K9,'FMIS and OBD'!$C$3:$EE$200,114,FALSE)","v":"EAP"},{"$f":"VLOOKUP($K9,'FMIS and OBD'!$C$3:$EE$200,133,FALSE)","v":"C"}]
[9,"Russian Federation","Argentina","Brazil","Brazil","Nicaragua","Spain","Argentina",null,9,"Colombia",3,{"$f":"VLOOKUP($K10,'FMIS and OBD'!$C$3:$EE$200,2,FALSE)","v":"UMIC"},{"$f":"VLOOKUP($K10,'FMIS and OBD'!$C$3:$EE$200,114,FALSE)","v":"LCR"},{"$f":"VLOOKUP($K10,'FMIS and OBD'!$C$3:$EE$200,133,FALSE)","v":"A"}]
[10,"Sweden","Bolivia","Mexico","Chile","West Bank and Gaza","Turkey","Brazil",null,10,"Denmark",1,{"$f":"VLOOKUP($K11,'FMIS and OBD'!$C$3:$EE$200,2,FALSE)","v":"HIC"},"ECA",{"$f":"VLOOKUP($K11,'FMIS and OBD'!$C$3:$EE$200,133,FALSE)","v":"B"}]
[11,"Argentina","Brazil","Paraguay","Colombia","India","Brazil","Dominican Republic",null,11,"Dominican Republic",2,{"$f":"VLOOKUP($K12,'FMIS and OBD'!$C$3:$EE$200,2,FALSE)","v":"UMIC"},{"$f":"VLOOKUP($K12,'FMIS and OBD'!$C$3:$EE$200,114,FALSE)","v":"LCR"},{"$f":"VLOOKUP($K12,'FMIS and OBD'!$C$3:$EE$200,133,FALSE)","v":"B"}]
[12,"Brazil","Chile","Peru","Guatemala",null,"Chile","Mexico",null,12,"Ecuador",1,{"$f":"VLOOKUP($K13,'FMIS and OBD'!$C$3:$EE$200,2,FALSE)","v":"UMIC"},{"$f":"VLOOKUP($K13,'FMIS and OBD'!$C$3:$EE$200,114,FALSE)","v":"LCR"},{"$f":"VLOOKUP($K13,'FMIS and OBD'!$C$3:$EE$200,133,FALSE)","v":"A"}]
[13,"Chile","Nicaragua","United States of America",null,null,"Colombia",null,null,13,"El salvador",1,{"$f":"VLOOKUP($K14,'FMIS and OBD'!$C$3:$EE$200,2,FALSE)","v":"LMIC"},{"$f":"VLOOKUP($K14,'FMIS and OBD'!$C$3:$EE$200,114,FALSE)","v":"LCR"},{"$f":"VLOOKUP($K14,'FMIS and OBD'!$C$3:$EE$200,133,FALSE)","v":"A"}]
[14,"Colombia","Venezuela, RB","Uruguay",null,null,"El Salvador",null,null,14,"Estonia",1,{"$f":"VLOOKUP($K15,'FMIS and OBD'!$C$3:$EE$200,2,FALSE)","v":"HIC"},{"$f":"VLOOKUP($K15,'FMIS and OBD'!$C$3:$EE$200,114,FALSE)","v":"ECA"},{"$f":"VLOOKUP($K15,'FMIS and OBD'!$C$3:$EE$200,133,FALSE)","v":"B"}]
[15,"Ecuador","Jordan","India",null,null,"Mexico",null,null,15,"Finland",1,{"$f":"VLOOKUP($K16,'FMIS and OBD'!$C$3:$EE$200,2,FALSE)","v":"HIC"},"ECA",{"$f":"VLOOKUP($K16,'FMIS and OBD'!$C$3:$EE$200,133,FALSE)","v":"B"}]
[16,"Mexico","India",null,null,null,null,null,null,16,"France",2,{"$f":"VLOOKUP($K17,'FMIS and OBD'!$C$3:$EE$200,2,FALSE)","v":"HIC"},"ECA",{"$f":"VLOOKUP($K17,'FMIS and OBD'!$C$3:$EE$200,133,FALSE)","v":"B"}]
[17,"Morocco","Pakistan",null,null,null,null,null,null,17,"Germany",2,{"$f":"VLOOKUP($K18,'FMIS and OBD'!$C$3:$EE$200,2,FALSE)","v":"HIC"},"ECA",{"$f":"VLOOKUP($K18,'FMIS and OBD'!$C$3:$EE$200,133,FALSE)","v":"A"}]
[18,"India",null,null,null,null,null,null,null,18,"Guatemala",1,{"$f":"VLOOKUP($K19,'FMIS and OBD'!$C$3:$EE$200,2,FALSE)","v":"LMIC"},{"$f":"VLOOKUP($K19,'FMIS and OBD'!$C$3:$EE$200,114,FALSE)","v":"LCR"},{"$f":"VLOOKUP($K19,'FMIS and OBD'!$C$3:$EE$200,133,FALSE)","v":"A"}]
[null,null,null,null,null,null,null,null,null,19,"India",4,{"$f":"VLOOKUP($K20,'FMIS and OBD'!$C$3:$EE$200,2,FALSE)","v":"LMIC"},{"$f":"VLOOKUP($K20,'FMIS and OBD'!$C$3:$EE$200,114,FALSE)","v":"SAR"},{"$f":"VLOOKUP($K20,'FMIS and OBD'!$C$3:$EE$200,133,FALSE)","v":"A"}]
[null,{"$f":"COUNTA(B2:B20)","v":18},17,15,12,11,15,12,null,20,"Indonesia",{"$f":"COUNTIF($B$2:$H$19,K21)","v":1},{"$f":"VLOOKUP($K21,'FMIS and OBD'!$C$3:$EE$200,2,FALSE)","v":"LMIC"},{"$f":"VLOOKUP($K21,'FMIS and OBD'!$C$3:$EE$200,114,FALSE)","v":"EAP"},{"$f":"VLOOKUP($K21,'FMIS and OBD'!$C$3:$EE$200,133,FALSE)","v":"B"}]
[null,null,null,null,null,null,null,{"$f":"SUM(B21:H21)","v":100},null,21,"Ireland",1,{"$f":"VLOOKUP($K22,'FMIS and OBD'!$C$3:$EE$200,2,FALSE)","v":"HIC"},"ECA",{"$f":"VLOOKUP($K22,'FMIS and OBD'!$C$3:$EE$200,133,FALSE)","v":"A"}]
[null,null,null,null,null,null,null,null,null,22,"Japan",1,{"$f":"VLOOKUP($K23,'FMIS and OBD'!$C$3:$EE$200,2,FALSE)","v":"HIC"},{"$f":"VLOOKUP($K23,'FMIS and OBD'!$C$3:$EE$200,114,FALSE)","v":"EAP"},{"$f":"VLOOKUP($K23,'FMIS and OBD'!$C$3:$EE$200,133,FALSE)","v":"B"}]
[null,null,null,null,null,null,null,null,null,23,"Jordan",1,{"$f":"VLOOKUP($K24,'FMIS and OBD'!$C$3:$EE$200,2,FALSE)","v":"UMIC"},{"$f":"VLOOKUP($K24,'FMIS and OBD'!$C$3:$EE$200,114,FALSE)","v":"MNA"},{"$f":"VLOOKUP($K24,'FMIS and OBD'!$C$3:$EE$200,133,FALSE)","v":"B"}]
[null,null,null,null,null,null,null,null,null,24,"Madagascar",1,{"$f":"VLOOKUP($K25,'FMIS and OBD'!$C$3:$EE$200,2,FALSE)","v":"LIC"},{"$f":"VLOOKUP($K25,'FMIS and OBD'!$C$3:$EE$200,114,FALSE)","v":"AFR"},{"$f":"VLOOKUP($K25,'FMIS and OBD'!$C$3:$EE$200,133,FALSE)","v":"B"}]
[null,null,null,null,null,null,null,null,null,25,"Malaysia",1,{"$f":"VLOOKUP($K26,'FMIS and OBD'!$C$3:$EE$200,2,FALSE)","v":"UMIC"},{"$f":"VLOOKUP($K26,'FMIS and OBD'!$C$3:$EE$200,114,FALSE)","v":"EAP"},{"$f":"VLOOKUP($K26,'FMIS and OBD'!$C$3:$EE$200,133,FALSE)","v":"B"}]
[null,null,null,null,null,null,null,null,null,26,"Mauritius",1,{"$f":"VLOOKUP($K27,'FMIS and OBD'!$C$3:$EE$200,2,FALSE)","v":"UMIC"},{"$f":"VLOOKUP($K27,'FMIS and OBD'!$C$3:$EE$200,114,FALSE)","v":"AFR"},{"$f":"VLOOKUP($K27,'FMIS and OBD'!$C$3:$EE$200,133,FALSE)","v":"B"}]
[null,null,null,null,null,null,null,null,null,27,"Mexico",4,{"$f":"VLOOKUP($K28,'FMIS and OBD'!$C$3:$EE$200,2,FALSE)","v":"UMIC"},{"$f":"VLOOKUP($K28,'FMIS and OBD'!$C$3:$EE$200,114,FALSE)","v":"LCR"},{"$f":"VLOOKUP($K28,'FMIS and OBD'!$C$3:$EE$200,133,FALSE)","v":"A"}]
[null,null,null,null,null,null,null,null,null,28,"Morocco",1,{"$f":"VLOOKUP($K29,'FMIS and OBD'!$C$3:$EE$200,2,FALSE)","v":"LMIC"},{"$f":"VLOOKUP($K29,'FMIS and OBD'!$C$3:$EE$200,114,FALSE)","v":"MNA"},{"$f":"VLOOKUP($K29,'FMIS and OBD'!$C$3:$EE$200,133,FALSE)","v":"B"}]
[null,null,null,null,null,null,null,null,null,29,"Netherlands",2,{"$f":"VLOOKUP($K30,'FMIS and OBD'!$C$3:$EE$200,2,FALSE)","v":"HIC"},"ECA",{"$f":"VLOOKUP($K30,'FMIS and OBD'!$C$3:$EE$200,133,FALSE)","v":"A"}]
[null,null,null,null,null,null,null,null,null,30,"Nicaragua",2,{"$f":"VLOOKUP($K31,'FMIS and OBD'!$C$3:$EE$200,2,FALSE)","v":"LMIC"},{"$f":"VLOOKUP($K31,'FMIS and OBD'!$C$3:$EE$200,114,FALSE)","v":"LCR"},{"$f":"VLOOKUP($K31,'FMIS and OBD'!$C$3:$EE$200,133,FALSE)","v":"A"}]
[null,null,null,null,null,null,null,null,null,31,"New Zealand",2,{"$f":"VLOOKUP($K32,'FMIS and OBD'!$C$3:$EE$200,2,FALSE)","v":"HIC"},"EAP",{"$f":"VLOOKUP($K32,'FMIS and OBD'!$C$3:$EE$200,133,FALSE)","v":"A"}]
[null,null,null,null,null,null,null,null,null,32,"Norway",2,{"$f":"VLOOKUP($K33,'FMIS and OBD'!$C$3:$EE$200,2,FALSE)","v":"HIC"},"ECA",{"$f":"VLOOKUP($K33,'FMIS and OBD'!$C$3:$EE$200,133,FALSE)","v":"B"}]
[null,null,null,null,null,null,null,null,null,33,"Pakistan",1,{"$f":"VLOOKUP($K34,'FMIS and OBD'!$C$3:$EE$200,2,FALSE)","v":"LMIC"},{"$f":"VLOOKUP($K34,'FMIS and OBD'!$C$3:$EE$200,114,FALSE)","v":"SAR"},{"$f":"VLOOKUP($K34,'FMIS and OBD'!$C$3:$EE$200,133,FALSE)","v":"B"}]
[null,null,null,null,null,null,null,null,null,34,"Paraguay",1,{"$f":"VLOOKUP($K35,'FMIS and OBD'!$C$3:$EE$200,2,FALSE)","v":"LMIC"},{"$f":"VLOOKUP($K35,'FMIS and OBD'!$C$3:$EE$200,114,FALSE)","v":"LCR"},{"$f":"VLOOKUP($K35,'FMIS and OBD'!$C$3:$EE$200,133,FALSE)","v":"A"}]
[null,null,null,null,null,null,null,null,null,35,"Peru",1,{"$f":"VLOOKUP($K36,'FMIS and OBD'!$C$3:$EE$200,2,FALSE)","v":"UMIC"},{"$f":"VLOOKUP($K36,'FMIS and OBD'!$C$3:$EE$200,114,FALSE)","v":"LCR"},{"$f":"VLOOKUP($K36,'FMIS and OBD'!$C$3:$EE$200,133,FALSE)","v":"A"}]
[null,null,null,null,null,null,null,null,null,36,"Philippines",2,{"$f":"VLOOKUP($K37,'FMIS and OBD'!$C$3:$EE$200,2,FALSE)","v":"LMIC"},{"$f":"VLOOKUP($K37,'FMIS and OBD'!$C$3:$EE$200,114,FALSE)","v":"EAP"},{"$f":"VLOOKUP($K37,'FMIS and OBD'!$C$3:$EE$200,133,FALSE)","v":"B"}]
[null,null,null,null,null,null,null,null,null,37,"Korea, Rep.",6,{"$f":"VLOOKUP($K38,'FMIS and OBD'!$C$3:$EE$200,2,FALSE)","v":"HIC"},{"$f":"VLOOKUP($K38,'FMIS and OBD'!$C$3:$EE$200,114,FALSE)","v":"EAP"},{"$f":"VLOOKUP($K38,'FMIS and OBD'!$C$3:$EE$200,133,FALSE)","v":"A"}]
[null,null,null,null,null,null,null,null,null,38,"Russian Federation",4,{"$f":"VLOOKUP($K39,'FMIS and OBD'!$C$3:$EE$200,2,FALSE)","v":"UMIC"},{"$f":"VLOOKUP($K39,'FMIS and OBD'!$C$3:$EE$200,114,FALSE)","v":"ECA"},{"$f":"VLOOKUP($K39,'FMIS and OBD'!$C$3:$EE$200,133,FALSE)","v":"A"}]
[null,null,null,null,null,null,null,null,null,39,"Singapore",3,{"$f":"VLOOKUP($K40,'FMIS and OBD'!$C$3:$EE$200,2,FALSE)","v":"HIC"},{"$f":"VLOOKUP($K40,'FMIS and OBD'!$C$3:$EE$200,114,FALSE)","v":"EAP"},{"$f":"VLOOKUP($K40,'FMIS and OBD'!$C$3:$EE$200,133,FALSE)","v":"A"}]
[null,null,null,null,null,null,null,null,null,40,"Slovenia",1,{"$f":"VLOOKUP($K41,'FMIS and OBD'!$C$3:$EE$200,2,FALSE)","v":"HIC"},{"$f":"VLOOKUP($K41,'FMIS and OBD'!$C$3:$EE$200,114,FALSE)","v":"ECA"},{"$f":"VLOOKUP($K41,'FMIS and OBD'!$C$3:$EE$200,133,FALSE)","v":"A"}]
[null,null,null,null,null,null,null,null,null,41,"Spain",1,{"$f":"VLOOKUP($K42,'FMIS and OBD'!$C$3:$EE$200,2,FALSE)","v":"HIC"},"ECA",{"$f":"VLOOKUP($K42,'FMIS and OBD'!$C$3:$EE$200,133,FALSE)","v":"A"}]
[null,null,null,null,null,null,null,null,null,42,"Sweden",1,{"$f":"VLOOKUP($K43,'FMIS and OBD'!$C$3:$EE$200,2,FALSE)","v":"HIC"},"ECA",{"$f":"VLOOKUP($K43,'FMIS and OBD'!$C$3:$EE$200,133,FALSE)","v":"B"}]
[null,null,null,null,null,null,null,null,null,43,"Thailand",1,{"$f":"VLOOKUP($K44,'FMIS and OBD'!$C$3:$EE$200,2,FALSE)","v":"UMIC"},{"$f":"VLOOKUP($K44,'FMIS and OBD'!$C$3:$EE$200,114,FALSE)","v":"EAP"},{"$f":"VLOOKUP($K44,'FMIS and OBD'!$C$3:$EE$200,133,FALSE)","v":"B"}]
[null,null,null,null,null,null,null,null,null,44,"Gambia",1,{"$f":"VLOOKUP($K45,'FMIS and OBD'!$C$3:$EE$200,2,FALSE)","v":"LIC"},{"$f":"VLOOKUP($K45,'FMIS and OBD'!$C$3:$EE$200,114,FALSE)","v":"AFR"},{"$f":"VLOOKUP($K45,'FMIS and OBD'!$C$3:$EE$200,133,FALSE)","v":"C"}]
[null,null,null,null,null,null,null,null,null,45,"Timor-Leste",1,{"$f":"VLOOKUP($K46,'FMIS and OBD'!$C$3:$EE$200,2,FALSE)","v":"LIC"},{"$f":"VLOOKUP($K46,'FMIS and OBD'!$C$3:$EE$200,114,FALSE)","v":"EAP"},{"$f":"VLOOKUP($K46,'FMIS and OBD'!$C$3:$EE$200,133,FALSE)","v":"B"}]
[null,null,null,null,null,null,null,null,null,46,"Turkey",3,{"$f":"VLOOKUP($K47,'FMIS and OBD'!$C$3:$EE$200,2,FALSE)","v":"UMIC"},{"$f":"VLOOKUP($K47,'FMIS and OBD'!$C$3:$EE$200,114,FALSE)","v":"ECA"},{"$f":"VLOOKUP($K47,'FMIS and OBD'!$C$3:$EE$200,133,FALSE)","v":"A"}]
[null,null,null,null,null,null,null,null,null,47,"United Kingdom",3,{"$f":"VLOOKUP($K48,'FMIS and OBD'!$C$3:$EE$200,2,FALSE)","v":"HIC"},"ECA",{"$f":"VLOOKUP($K48,'FMIS and OBD'!$C$3:$EE$200,133,FALSE)","v":"A"}]
[null,null,null,null,null,null,null,null,null,48,"United States of America",1,{"$f":"VLOOKUP($K49,'FMIS and OBD'!$C$3:$EE$200,2,FALSE)","v":"HIC"},"LCR",{"$f":"VLOOKUP($K49,'FMIS and OBD'!$C$3:$EE$200,133,FALSE)","v":"A"}]
[null,null,null,null,null,null,null,null,null,49,"Uruguay",1,{"$f":"VLOOKUP($K50,'FMIS and OBD'!$C$3:$EE$200,2,FALSE)","v":"UMIC"},{"$f":"VLOOKUP($K50,'FMIS and OBD'!$C$3:$EE$200,114,FALSE)","v":"LCR"},{"$f":"VLOOKUP($K50,'FMIS and OBD'!$C$3:$EE$200,133,FALSE)","v":"B"}]
[null,null,null,null,null,null,null,null,null,50,"Venezuela, RB",1,{"$f":"VLOOKUP($K51,'FMIS and OBD'!$C$3:$EE$200,2,FALSE)","v":"UMIC"},{"$f":"VLOOKUP($K51,'FMIS and OBD'!$C$3:$EE$200,114,FALSE)","v":"LCR"},{"$f":"VLOOKUP($K51,'FMIS and OBD'!$C$3:$EE$200,133,FALSE)","v":"B"}]
[null,null,null,null,null,null,null,null,null,51,"Viet Nam",1,{"$f":"VLOOKUP($K52,'FMIS and OBD'!$C$3:$EE$200,2,FALSE)","v":{"$error":"#N/A"}},{"$f":"VLOOKUP($K52,'FMIS and OBD'!$C$3:$EE$200,114,FALSE)","v":{"$error":"#N/A"}},{"$f":"VLOOKUP($K52,'FMIS and OBD'!$C$3:$EE$200,133,FALSE)","v":{"$error":"#N/A"}}]
[null,null,null,null,null,null,null,null,null,52,"West Bank and Gaza",1,{"$f":"VLOOKUP($K53,'FMIS and OBD'!$C$3:$EE$200,2,FALSE)","v":"LIC"},{"$f":"VLOOKUP($K53,'FMIS and OBD'!$C$3:$EE$200,114,FALSE)","v":"MNA"},{"$f":"VLOOKUP($K53,'FMIS and OBD'!$C$3:$EE$200,133,FALSE)","v":"C"}]
[null,null,null,null,null,null,null,null,null,53,"Zambia",1,{"$f":"VLOOKUP($K54,'FMIS and OBD'!$C$3:$EE$200,2,FALSE)","v":"LMIC"},{"$f":"VLOOKUP($K54,'FMIS and OBD'!$C$3:$EE$200,114,FALSE)","v":"AFR"},{"$f":"VLOOKUP($K54,'FMIS and OBD'!$C$3:$EE$200,133,FALSE)","v":"B"}]
[null,null,null,null,null,null,null,null,null,null,null,{"$f":"SUM(L2:L54)","v":100}]

{"sheet":"Economy","index":3,"n_rows":81,"n_cols":10,"rows_kept":81,"cut":false,"hidden":false,"merged":[[2,0,5,0],[8,0,14,0],[15,0,18,0],[21,0,23,0],[24,0,27,0],[54,0,55,0],[6,0,7,0],[50,0,51,0],[66,0,67,0],[71,0,75,0],[62,0,63,0],[64,0,65,0],[68,0,70,0],[52,0,53,0],[19,0,20,0],[56,0,61,0],[28,0,30,0],[31,0,34,0],[35,0,37,0],[38,0,49,0]]}
[{"$f":"INDIRECT(\"'FMIS and OBD'!C\"&J1+2)","v":"Belarus"},{"$f":"INDIRECT(\"'FMIS and OBD'!ED\"&$J$1+2)","v":34.615384615384613},{"$f":"INDIRECT(\"'FMIS and OBD'!EE\"&$J$1+2)","v":"C"},null,null,"Feedback provided by:",null,null,null,16]
["Questions","Q","Ind","Assessing the effects of FMIS on budget transparency","External assessment results","Confirm: Y/N","If No > Comments from feedback provider",null,null,"Val"]
["Q1.    Does the Finance Ministry/Dept have a web site or portal dedicated to publish Public Finance (PF) information?","Q1.1",null,"PF home page Uniform Resource Locator (URL)",{"$f":"IF(J3=\"-\",\" -\",\" \"&J3)","v":" http://www.minfin.gov.by "},null,null,null,null,{"$f":"INDIRECT(\"'FMIS and OBD'!H\"&$J$1+2)","v":"http://www.minfin.gov.by "}]
[null,"Q1.2",null,"Official Name of Finance Ministry / Department",{"$f":"\" \"&J4","v":" Ministry for Finance of Belarus"},null,null,null,null,{"$f":"INDIRECT(\"'FMIS and OBD'!I\"&$J$1+2)","v":"Ministry for Finance of Belarus"}]
[null,"Q1.3",1,"Is there a dedicated PF publication web site?\n    0 = No;        1 = Yes (but, not clearly visible from home page);\n    2 = Yes (easy access to PF data from the home page)",{"$f":"IF(J5=2,\" 2 = Yes (easy access to PF data)\",IF(J5=1,\" 1 = Yes (but, not clearly visible)\",\" 0 = No\"))","v":" 2 = Yes (easy access to PF data)"},null,null,null,null,{"$f":"INDIRECT(\"'FMIS and OBD'!J\"&$J$1+2)","v":2}]
[null,"Q1.4",null,"If Yes to Q1.3 (1 or 2) > PF publication web link/URL",{"$f":"IF(J6=\"-\",\" -\",\" \"&J6)","v":" http://www.minfin.gov.by/rmenu/execution/month-info/"},null,null,null,null,{"$f":"INDIRECT(\"'FMIS and OBD'!K\"&$J$1+2)","v":"http://www.minfin.gov.by/rmenu/execution/month-info/"}]
["Q2.    Is there a web site or document describing the FMIS solution?","Q2.1",2,"Is there a web site / doc on FMIS solution?\n    0 = No;    1 = Yes (reference doc only);    2 = Yes (FMIS related web site)",{"$f":"IF(J7=2,\" 2 = Yes (FMIS web site)\",IF(J7=1,\" 1 = Yes (reference doc only)\",IF(J7=0,\" 0 = No\",\" -\")))","v":" 1 = Yes (reference doc only)"},null,null,null,null,{"$f":"INDIRECT(\"'FMIS and OBD'!L\"&$J$1+2)","v":1}]
[null,"Q2.2",null,"If Yes to Q2.1 (1 or 2) > Related web link/URL",{"$f":"IF(J8=\"-\",\" -\",\" \"&J8)","v":" http://siteresources.worldbank.org/BELARUSEXTN/Resources/PEFA_Belarus_april_2009_english.pdf"},null,null,null,null,{"$f":"INDIRECT(\"'FMIS and OBD'!M\"&$J$1+2)","v":"http://siteresources.worldbank.org/BELARUSEXTN/Resources/PEFA_Belarus_april_2009_english.pdf"}]
["Q3.    What is the source 1 of information for publishing PF information? ","Q3.1",3,"What is the source of Public Finance data?\n    0 = No published PF data;        1 = Static (tables from unidentified sources);\n    2 = Dynamic (archived info/docs from systems);\n    3 = Dynamic (data/tables fm queries linked to FMIS DB/Data Warehouse)",{"$f":"IF(J9=3,\" 3 = Dynamic (data fm queries)\",IF(J9=2,\" 2 = Dynamic (archived info)\",IF(J9=1,\" 1 = Static (tables/docs)\",\" 0 = No published PF data\")))","v":" 1 = Static (tables/docs)"},null,null,null,null,{"$f":"INDIRECT(\"'FMIS and OBD'!N\"&$J$1+2)","v":1}]
[null,"Q3.2",null,"If Dynamic (2 or 3) > Related web link/URL",{"$f":"IF(J10=\"-\",\" -\",\" \"&J10)","v":" -"},null,null,null,null,{"$f":"INDIRECT(\"'FMIS and OBD'!O\"&$J$1+2)","v":"-"}]
[null,"Q3.3",4,"Presence of Open Data (online, editable, free):                         0 = No;    1 = Yes",{"$f":"IF(J11=1,\" 1 = Yes\",\" 0 = No\")","v":" 0 = No"},null,null,null,null,{"$f":"INDIRECT(\"'FMIS and OBD'!P\"&$J$1+2)","v":0}]
[null,"Q3.4",null,"If Yes to Open Data (1) > Related web link/URL",{"$f":"IF(J12=\"-\",\" -\",\" \"&J12)","v":" -"},null,null,null,null,{"$f":"INDIRECT(\"'FMIS and OBD'!Q\"&$J$1+2)","v":"-"}]
[null,"Q3.5",5,"Is System Name visible in reports?                                                    0 = No;   1 = Yes",{"$f":"IF(J13=1,\" 1 = Yes\",\" 0 = No\")","v":" 0 = No"},null,null,null,null,{"$f":"INDIRECT(\"'FMIS and OBD'!R\"&$J$1+2)","v":0}]
[null,"Q3.6",6,"Is System Time Stamp visible in reports?                                        0 = No;   1 = Yes",{"$f":"IF(J14=1,\" 1 = Yes\",\" 0 = No\")","v":" 0 = No"},null,null,null,null,{"$f":"INDIRECT(\"'FMIS and OBD'!S\"&$J$1+2)","v":0}]
[null,"Q3.7",null,"If Yes to Q3.5 or Q3.6 (1) > Related web link/URL",{"$f":"IF(J15=\"-\",\" -\",\" \"&J15)","v":" -"},null,null,null,null,{"$f":"INDIRECT(\"'FMIS and OBD'!T\"&$J$1+2)","v":"-"}]
["Q4.    Is the PF information meaningful to citizens or budget entities?","Q4.1",7,"What is the quality of PF data presentation? \n    0 = Below desired level (not informative);   1 = Partially acceptable (some\n    of the tables are useful);    2 = Good quality (informative and easy to read)",{"$f":"IF(J16=2,\" 2 = Good quality (informative)\",IF(J16=1,\" 1 = Partially acceptable\",\" 0 = Below desired level\"))","v":" 2 = Good quality (informative)"},null,null,null,null,{"$f":"INDIRECT(\"'FMIS and OBD'!U\"&$J$1+2)","v":2}]
[null,"Q4.2",8,"Content > Is there sufficient level of detail?                                 0 = No;    1 = Yes",{"$f":"IF(J17=1,\" 1 = Yes\",\" 0 = No\")","v":" 1 = Yes"},null,null,null,null,{"$f":"INDIRECT(\"'FMIS and OBD'!V\"&$J$1+2)","v":1}]
[null,"Q4.3",9,"Citizen's Budget (CB) > Is there a web site for citizens presenting budget results in a meaningful format?\n    0 = No;    1 = Yes (basic info);    2 = Yes (comprehensive info/interactive)",{"$f":"IF(J18=2,\" 2 = Yes (comprehensive/interactive)\",IF(J18=1,\" 1 = Yes (archived info)\",\" 0 = No\"))","v":" 0 = No"},null,null,null,null,{"$f":"INDIRECT(\"'FMIS and OBD'!W\"&$J$1+2)","v":0}]
[null,"Q4.4",null,"If Yes to Q4.3 (1 or 2) > Related web link/URL",{"$f":"IF(J19=\"-\",\" -\",\" \"&J19)","v":" -"},null,null,null,null,{"$f":"INDIRECT(\"'FMIS and OBD'!X\"&$J$1+2)","v":"-"}]
["Q5.    Is the data structure / listing of budget classification (BC) / chart of accounts (CoA) published?","Q5.1",10,"Is BC/CoA published?                                                                             0 = No;    1 = Yes",{"$f":"IF(J20=1,\" 1 = Yes\",\" 0 = No\")","v":" 0 = No"},null,null,null,null,{"$f":"INDIRECT(\"'FMIS and OBD'!Y\"&$J$1+2)","v":0}]
[null,"Q5.2",null,"If Yes to Q5.1 (1) > Related web site/URL",{"$f":"IF(J21=\"-\",\" -\",\" \"&J21)","v":" -"},null,null,null,null,{"$f":"INDIRECT(\"'FMIS and OBD'!Z\"&$J$1+2)","v":"-"}]
["Q6.    Are documents associated with annual budget plans published?","Q6.1",11,"Approved annual budget published?                                              0 = No;    1 = Yes",{"$f":"IF(J22=1,\" 1 = Yes\",\" 0 = No\")","v":" 0 = No"},null,null,null,null,{"$f":"INDIRECT(\"'FMIS and OBD'!AA\"&$J$1+2)","v":0}]
[null,"Q6.2",12,"If Yes to Q6.1 (1) > Regularity of publication                                0 = Not regular; \n    1 = Annual budget plans published regularly (within the last 5-year period)",{"$f":"IF(J23=1,\" 1 = Budget plans regularly published\",IF(J23=0,\" 0 = Not regular\",\" -\"))","v":" 0 = Not regular"},null,null,null,null,{"$f":"INDIRECT(\"'FMIS and OBD'!AB\"&$J$1+2)","v":0}]
[null,"Q6.3",null,"Since          Starting year of published annual budget data (regular/irregular)",{"$f":"IF(J24=\"-\",\" -\",\" \"&J24)","v":" -"},null,null,null,null,{"$f":"INDIRECT(\"'FMIS and OBD'!AC\"&$J$1+2)","v":"-"}]
["Q7.    Are documents associated with Medium-Term Expenditure Framework (MTEF) 2 published?","Q7.1",13,"MTEF documents published?                                                              0 = No;    1 = Yes",{"$f":"IF(J25=1,\" 1 = Yes\",\" 0 = No\")","v":" 0 = No"},null,null,null,null,{"$f":"INDIRECT(\"'FMIS and OBD'!AD\"&$J$1+2)","v":0}]
[null,"Q7.2",14,"If Yes to Q7.1 (1) > Regularity of publication                                 0 = Not regular;\n    1 = MTEF plans published regularly (within the last 5-year period)",{"$f":"IF(J26=1,\" 1 = MTEF plans regularly published\",IF(J26=0,\" 0 = Not regular\",\" -\"))","v":" 0 = Not regular"},null,null,null,null,{"$f":"INDIRECT(\"'FMIS and OBD'!AE\"&$J$1+2)","v":0}]
[null,"Q7.3",null,"Period         Indicate the period (in years) of the MTEF (usually 3 yrs or more)",{"$f":"IF(OR(J27=\"-\",J27=0),\" -\",IF(J27=1,\" \"&J27&\" yr\",\" \"&J27&\" yrs\"))","v":" -"},null,null,null,null,{"$f":"INDIRECT(\"'FMIS and OBD'!AF\"&$J$1+2)","v":"-"}]
[null,"Q7.4",null,"Since            Starting year of published MTEF data (regular/irregular)",{"$f":"IF(J28=\"-\",\" -\",\" \"&J28)","v":" -"},null,null,null,null,{"$f":"INDIRECT(\"'FMIS and OBD'!AG\"&$J$1+2)","v":"-"}]
["Q8.    Are documents associated with public investment/capital budget plans 3 published?","Q8.1",15,"Public investment plans?                                                                      0 = No;    1 = Yes",{"$f":"IF(J29=1,\" 1 = Yes\",\" 0 = No\")","v":" 0 = No"},null,null,null,null,{"$f":"INDIRECT(\"'FMIS and OBD'!AH\"&$J$1+2)","v":0}]
[null,"Q8.2",16,"If Yes to Q8.1 (1) > Regularity of publication                                 0 = Not regular; \n    1 = Investment plans published regularly (within the last 5-year period)",{"$f":"IF(J30=1,\" 1 = Investment plans regularly pub.\",IF(J30=0,\" 0 = Not regular\",\" -\"))","v":" 0 = Not regular"},null,null,null,null,{"$f":"INDIRECT(\"'FMIS and OBD'!AI\"&$J$1+2)","v":0}]
[null,"Q8.3",null,"Since            Starting year of published investment plans (regular/irregular)",{"$f":"IF(J31=\"-\",\" -\",\" \"&J31)","v":" -"},null,null,null,null,{"$f":"INDIRECT(\"'FMIS and OBD'!AJ\"&$J$1+2)","v":"-"}]
["Q9.    Are documents associated with budget execution published?","Q9.1",17,"Budget execution results?                                                                    0 = No;    1 = Yes",{"$f":"IF(J32=1,\" 1 = Yes\",\" 0 = No\")","v":" 1 = Yes"},null,null,null,null,{"$f":"INDIRECT(\"'FMIS and OBD'!AK\"&$J$1+2)","v":1}]
[null,"Q9.2",null,"If Yes to Q9.1 (1) > Frequency of publication:    (most frequently published)\n    1 = Weekly;    2 = Monthly;    3 = Quarterly;    4 = Annually",{"$f":"IF(J33=1,\" 1 = Weekly\",IF(J33=2,\" 2 = Monthly\",IF(J33=3,\" 3 = Quarterly\",IF(J33=4,\" 4 = Annually\",\" -\"))))","v":" 2 = Monthly"},null,null,null,null,{"$f":"INDIRECT(\"'FMIS and OBD'!AL\"&$J$1+2)","v":2}]
[null,"Q9.3",18,"If Yes to Q9.1 (1) > Regularity of publication:                               0 = Not regular;\n    1 = Budget exec results published regularly (within the last 5-year period)",{"$f":"IF(J34=1,\" 1 = Budget exec results regularly pub.\",IF(J34=0,\" 0 = Not regular\",\" -\"))","v":" 1 = Budget exec results regularly pub."},null,null,null,null,{"$f":"INDIRECT(\"'FMIS and OBD'!AM\"&$J$1+2)","v":1}]
[null,"Q9.4",null,"Since           Starting year of published execution results (regular/irregular)",{"$f":"IF(J35=\"-\",\" -\",\" \"&J35)","v":" 2005"},null,null,null,null,{"$f":"INDIRECT(\"'FMIS and OBD'!AN\"&$J$1+2)","v":2005}]
["Q10.    Are documents associated with external audit of central government budget operations published?","Q10.1",19,"External audit of central gov budget operations?                      0 = No;    1 = Yes",{"$f":"IF(J36=1,\" 1 = Yes\",\" 0 = No\")","v":" 0 = No"},null,null,null,null,{"$f":"INDIRECT(\"'FMIS and OBD'!AO\"&$J$1+2)","v":0}]
[null,"Q10.2",20,"If Yes to Q10.1 (1) > Regularity of publication:                             0 = Not regular;\n    1 = Budget audits published regularly (within the last 5-year period)",{"$f":"IF(J37=1,\" 1 = Budget audits regularly published\",IF(J37=0,\" 0 = Not regular\",\" -\"))","v":" 0 = Not regular"},null,null,null,null,{"$f":"INDIRECT(\"'FMIS and OBD'!AP\"&$J$1+2)","v":0}]
[null,"Q10.3",null,"Since           Starting year of published budget audits (regular/irregular)",{"$f":"IF(J38=\"-\",\" -\",\" \"&J38)","v":" -"},null,null,null,null,{"$f":"INDIRECT(\"'FMIS and OBD'!AQ\"&$J$1+2)","v":"-"}]
["Q11.    What is the level of detail of the public expenditure / revenue information published online (plans versus actuals, sectoral or regional details, etc.)?","Q11.1",21,"Consolidated results for key budget users?                                  0 = No;    1 = Yes",{"$f":"IF(J39=1,\" 1 = Yes\",\" 0 = No\")","v":" 1 = Yes"},null,null,null,null,{"$f":"INDIRECT(\"'FMIS and OBD'!AR\"&$J$1+2)","v":1}]
[null,"Q11.2",22,"Sector analysis?                                                                                         0 = No;    1 = Yes"," 1 = Yes",null,null,null,null,{"$f":"INDIRECT(\"'FMIS and OBD'!AS\"&$J$1+2)","v":1}]
[null,"Q11.3",23,"Regional analysis?                                                                                    0 = No;    1 = Yes"," 1 = Yes",null,null,null,null,{"$f":"INDIRECT(\"'FMIS and OBD'!AT\"&$J$1+2)","v":1}]
[null,"Q11.4",24,"Gender analysis?                                                                                      0 = No;    1 = Yes"," 0 = No",null,null,null,null,{"$f":"INDIRECT(\"'FMIS and OBD'!AU\"&$J$1+2)","v":0}]
[null,"Q11.5",25,"Analysis of spending for Children?                                                   0 = No;    1 = Yes"," 1 = Yes",null,null,null,null,{"$f":"INDIRECT(\"'FMIS and OBD'!AV\"&$J$1+2)","v":1}]
[null,"Q11.6",26,"Debt data?                                                                                                   0 = No;    1 = Yes"," 1 = Yes",null,null,null,null,{"$f":"INDIRECT(\"'FMIS and OBD'!AW\"&$J$1+2)","v":1}]
[null,"Q11.7",27,"Foreign aid/grants?                                                                                 0 = No;    1 = Yes"," 1 = Yes",null,null,null,null,{"$f":"INDIRECT(\"'FMIS and OBD'!AX\"&$J$1+2)","v":1}]
[null,"Q11.8",28,"Fiscal data on sub-national gov/municipalities?                         0 = No;    1 = Yes"," 1 = Yes",null,null,null,null,{"$f":"INDIRECT(\"'FMIS and OBD'!AY\"&$J$1+2)","v":1}]
[null,"Q11.9",29,"Financial Statements?                                                                            0 = No;    1 = Yes"," 1 = Yes",null,null,null,null,{"$f":"INDIRECT(\"'FMIS and OBD'!AZ\"&$J$1+2)","v":1}]
[null,"Q11.10",30,"Public procurement and contracts?                                                  0 = No;    1 = Yes"," 0 = No",null,null,null,null,{"$f":"INDIRECT(\"'FMIS and OBD'!BA\"&$J$1+2)","v":0}]
[null,"Q11.11",null,"Other PF Data?                                                                                           0 = No;    1 = Yes"," 0 = No",null,null,null,null,{"$f":"INDIRECT(\"'FMIS and OBD'!BB\"&$J$1+2)","v":0}]
[null,"Q11.12",null,"If Yes to Q11.11 (1) > Related web link/URL",{"$f":"IF(J50=\"-\",\" -\",\" \"&J50)","v":" -"},null,null,null,null,{"$f":"INDIRECT(\"'FMIS and OBD'!BC\"&$J$1+2)","v":"-"}]
["Q12.    Is there a dedicated web site of Open Government / Open Budget initiatives?","Q12.1",31,"Open Government/Open Budget web site?                                 0 = No;    1 = Yes",{"$f":"IF(J51=1,\" 1 = Yes\",\" 0 = No\")","v":" 0 = No"},null,null,null,null,{"$f":"INDIRECT(\"'FMIS and OBD'!BD\"&$J$1+2)","v":0}]
[null,"Q12.2",null,"If Yes to Q12.1 (1) > Related web link/URL",{"$f":"IF(J52=\"-\",\" -\",\" \"&J52)","v":" -"},null,null,null,null,{"$f":"INDIRECT(\"'FMIS and OBD'!BE\"&$J$1+2)","v":"-"}]
["Q13.    Is there a web based application supporting the PFM needs of the state/local governments or municipalities as a part of FMIS solution?","Q13.1",32,"Does FMIS support the PFM needs of state/local governments or municipalities?                0 = No;    1 = Yes (only data collection/consolidation);\n    2 = Yes (support some of the SNG automation + data collection needs)",{"$f":"IF(J53=2,\" 2 = Yes (support SNG automation)\",IF(J53=1,\" 1 = Yes (only data collection)\",IF(J53=0,\" 0 = No\",\" -\")))","v":" 0 = No"},null,null,null,null,{"$f":"INDIRECT(\"'FMIS and OBD'!BF\"&$J$1+2)","v":0}]
[null,"Q13.2",null,"If Yes to Q13.1 (1 or 2) > Related web site/URL",{"$f":"IF(J54=\"-\",\" -\",\" \"&J54)","v":" -"},null,null,null,null,{"$f":"INDIRECT(\"'FMIS and OBD'!BG\"&$J$1+2)","v":"-"}]
["Q14.    Is there a harmonized public accounting system supporting all budget levels (unified chart of accounts and/or budget classification)?","Q14.1",33,"Is there a harmonized public accounting system for central + state/local governments and municipalities?                                                     0 = No;    1 = Yes",{"$f":"IF(J55=1,\" 1 = Yes\",\" 0 = No\")","v":" 1 = Yes"},null,null,null,null,{"$f":"INDIRECT(\"'FMIS and OBD'!BH\"&$J$1+2)","v":1}]
[null,"Q14.2",null,"If Yes to Q14.1 (1) > Related web link/URL",{"$f":"IF(J56=\"-\",\" -\",\" \"&J56)","v":" http://www.minfin.gov.by/rmenu/gfs/general/"},null,null,null,null,{"$f":"INDIRECT(\"'FMIS and OBD'!BI\"&$J$1+2)","v":"http://www.minfin.gov.by/rmenu/gfs/general/"}]
["Q15.    Are there other government web sites reporting budget results/performance (e.g. Office of Statistics)?","Q15.1",34,"Is PF data published on the Statistics web site?    Or another web site?\n    0 = Statistics web site with no PF data;  \n    1 = Statistics web site publishing PF data;   \n    2 = Other web site publishing PF data (no Stats web site for PF data);  \n    3 = Both Statistics and other web sites publish PF data",{"$f":"IF(J57=3,\" 3 = Both Stats + other web sites\",IF(J57=2,\" 2 = Other web sites (no PF data on Stats)\",IF(J57=1,\" 1 = Stats web site publishing PF data\",\" 0 = Stats web site with no PF data\")))","v":" 0 = Stats web site with no PF data"},null,null,null,null,{"$f":"INDIRECT(\"'FMIS and OBD'!BJ\"&$J$1+2)","v":0}]
[null,"Q15.2",null,"If Q15.1 = 0 or 1 > URL of the Statistics Org web site",{"$f":"IF(J58=\"-\",\" -\",\" \"&J58)","v":" http://www.belstat.gov.by"},null,null,null,null,{"$f":"INDIRECT(\"'FMIS and OBD'!BK\"&$J$1+2)","v":"http://www.belstat.gov.by"}]
[null,"Q15.3",null,"Official Name of Statistical Organization",{"$f":"\" \"&J59","v":" Belarus Ministry of Statistics and Analysis"},null,null,null,null,{"$f":"INDIRECT(\"'FMIS and OBD'!BL\"&$J$1+2)","v":"Belarus Ministry of Statistics and Analysis"}]
[null,"Q15.4",null,"URL of the Central Bank",{"$f":"\" \"&J60","v":" http://www.nbrb.by"},null,null,null,null,{"$f":"INDIRECT(\"'FMIS and OBD'!BM\"&$J$1+2)","v":"http://www.nbrb.by"}]
[null,"Q15.5",null,"Official Name of Central Bank",{"$f":"\" \"&J61","v":" National Bank of the Republic of Belarus"},null,null,null,null,{"$f":"INDIRECT(\"'FMIS and OBD'!BN\"&$J$1+2)","v":"National Bank of the Republic of Belarus"}]
[null,"Q15.6",null,"If Q15.1 = 2 or 3 > URL of other major alternative PF publication web site",{"$f":"IF(J62=\"-\",\" -\",\" \"&J62)","v":" -"},null,null,null,null,{"$f":"INDIRECT(\"'FMIS and OBD'!BO\"&$J$1+2)","v":"-"}]
["Q16.    Is there a web page explaining the policy/regulations for access to PF information, web publishing standards or frequency of PF reporting?","Q16.1",35,"Access to information explained?                                                     0 = No;    1 = Yes",{"$f":"IF(J63=1,\" 1 = Yes\",\" 0 = No\")","v":" 0 = No"},null,null,null,null,{"$f":"INDIRECT(\"'FMIS and OBD'!BP\"&$J$1+2)","v":0}]
[null,"Q16.2",null,"If Yes to Q16.1 (1) > Related web site/URL",{"$f":"IF(J64=\"-\",\" -\",\" \"&J64)","v":" -"},null,null,null,null,{"$f":"INDIRECT(\"'FMIS and OBD'!BQ\"&$J$1+2)","v":"-"}]
["Q17.    Is there a web page with links to regulations 4 for clarifying the PFM roles and responsibilities?","Q17.1",36,"Clarity of PFM roles and responsibilities on the web site?    0 = No;    1 = Yes",{"$f":"IF(J65=1,\" 1 = Yes\",\" 0 = No\")","v":" 1 = Yes"},null,null,null,null,{"$f":"INDIRECT(\"'FMIS and OBD'!BR\"&$J$1+2)","v":1}]
[null,"Q17.2",null,"If Yes to Q17.1 (1) > Related web site/URL",{"$f":"IF(J66=\"-\",\" -\",\" \"&J66)","v":" http://www.minfin.gov.by/ministerstvo/structure/"},null,null,null,null,{"$f":"INDIRECT(\"'FMIS and OBD'!BS\"&$J$1+2)","v":"http://www.minfin.gov.by/ministerstvo/structure/"}]
["Q18.    Is published PF data compliant with the IMF GFS and/or UN COFOG standards?","Q18.1",37,"Compliance with specific int'l standards?                                     0 = National only;\n    1 = UN COFOG reports;    2 = IMF GFS reports (incl COFOG)",{"$f":"IF(J67=2,\" 2 = IMF GFS reports\",IF(J67=1,\" 1 = UN COFOG\",\" 0 = National only\"))","v":" 2 = IMF GFS reports"},null,null,null,null,{"$f":"INDIRECT(\"'FMIS and OBD'!BT\"&$J$1+2)","v":2}]
[null,"Q18.2",null,"If Other > Please describe reporting formats",{"$f":"IF(J68=\"-\",\" -\",\" \"&J68)","v":" -"},null,null,null,null,{"$f":"INDIRECT(\"'FMIS and OBD'!BU\"&$J$1+2)","v":"-"}]
["Q19.    Is there a web page for receiving feedback on PF information/user satisfaction, or presenting web statistics?","Q19.1",38,"Web Statistics (e.g. visitors, freq visited web pages)?             0 = No;    1 = Yes",{"$f":"IF(J69=1,\" 1 = Yes\",\" 0 = No\")","v":" 0 = No"},null,null,null,null,{"$f":"INDIRECT(\"'FMIS and OBD'!BV\"&$J$1+2)","v":0}]
[null,"Q19.2",39,"Which platforms are available for feedback provision?          0 = Not available;\n    1 = Email / Specific forms;       2 = Telephone/Fax/Mail;       3 = All",{"$f":"IF(J70=3,\" 3 = All\",IF(J70=2,\" 2 = Telephone/Fax/Mail\",IF(J70=1,\" 1 = Email / Specific forms\",\" 0 = Not available\")))","v":" 3 = All"},null,null,null,null,{"$f":"INDIRECT(\"'FMIS and OBD'!BW\"&$J$1+2)","v":3}]
[null,"Q19.3",null,"If Other > Please describe other feedback mechanism in a few words",{"$f":"IF(J71=\"-\",\" -\",\" \"&J71)","v":" -"},null,null,null,null,{"$f":"INDIRECT(\"'FMIS and OBD'!BX\"&$J$1+2)","v":"-"}]
["Q20.    What languages are used to publish PF information online for external viewers?","Q20.1",40,"Native language?     Indicate native language code (ISO 639-2 Code alpha-3)",{"$f":"IF(J72=\"-\",\" -\",\" \"&J72)","v":" rus"},null,null,null,null,{"$f":"INDIRECT(\"'FMIS and OBD'!BY\"&$J$1+2)","v":"rus"}]
[null,"Q20.2",null,"Language #1 option?                                             Indicate other language #1 code:",{"$f":"IF(J73=\"-\",\" -\",\" \"&J73)","v":" -"},null,null,null,null,{"$f":"INDIRECT(\"'FMIS and OBD'!BZ\"&$J$1+2)","v":"-"}]
[null,"Q20.3",null,"Language #2 option?                                             Indicate other language #2 code:",{"$f":"IF(J74=\"-\",\" -\",\" \"&J74)","v":" -"},null,null,null,null,{"$f":"INDIRECT(\"'FMIS and OBD'!CA\"&$J$1+2)","v":"-"}]
[null,"Q20.4",null,"Language #3 option?                                             Indicate other language #3 code:",{"$f":"IF(J75=\"-\",\" -\",\" \"&J75)","v":" -"},null,null,null,null,{"$f":"INDIRECT(\"'FMIS and OBD'!CB\"&$J$1+2)","v":"-"}]
[null,"Q20.5",null,"Change of contents for PF data in different languages:\n    0 = Less detail;    1 = Same level of detail in different languages",{"$f":"IF(J76=0,\" 0 = Less detail in other lang\",IF(J76=1,\" 1 = Same level of detail\",\" -\"))","v":" -"},null,null,null,null,{"$f":"INDIRECT(\"'FMIS and OBD'!CC\"&$J$1+2)","v":"-"}]
[]
["1  Dynamic query provides options for the online submission of a user-defined query in order to generate specific PF reports  in various formats, from the FMIS databases or data warehouse."]
["2  MTEF consists of three stages: (i) Medium Term Fiscal Framework (MTFF), (ii) Medium Term Budget Framework (MTBF), and (iii) Medium Term Performance Framework (MTPF)"]
["3  This indicator is used to highlight the publication of investment plans published separately (not embedded in the annual budget or the national development plan/strategy)."]
["4  Online availability of regulations, organic budget law, procurement law, etc."]

{"sheet":"Points","index":4,"n_rows":41,"n_cols":6,"rows_kept":41,"cut":false,"hidden":false,"merged":[]}
["Ind","Que","Assessing the effects of FMIS on publishing reliable open budget data","Points","Max Pts",{"$f":"SUM(E2:E21)","v":26}]
[1,"Q1.3","Is there a dedicated PF publication web site?\n    0 = No;        1 = Yes (but, not clearly visible from home page);\n    2 = Yes (easy access to PF data from the home page)","0 … 2",2]
[2,"Q2.1","Is there a web page describing the FMIS platform / Data Warehouse?\n    0 = No;    1 = Yes (reference doc only);    2 = Yes (FMIS related web site)","0 .. 2",2]
[3,"Q3.1","Source of PF data:\n    0 = No published PF data;        1 = Static (tables from unidentified sources);\n    2 = Dynamic (archived info/docs from systems);\n    3 = Dynamic (data/tables fm queries linked to FMIS DB/Data Warehouse)","0 … 3",3]
[4,"Q3.3","Presence of Open Data (online, editable, free):                         0 = No;    1 = Yes","0 / 1",1]
[5,"Q3.5","System Name visible in dynamic/static reports:                          0 = No;   1 = Yes","0 / 1",1]
[6,"Q3.6","System Time Stamp visible in dynamic/static reports:              0 = No;   1 = Yes","0 / 1",1]
[7,"Q4.1","Quality of information (level of detail visible at first sight): \n    0 = Below desired level (not informative);   1 = Partially acceptable (some\n    of the tables are useful);    2 = Good quality (informative and easy to read)","0 … 2",2]
[8,"Q4.2","Content > Is there sufficient level of detail for users?              0 = No;    1 = Yes","0 / 1",1]
[9,"Q4.3","Citizen's Budget (CB) > Is there a web site for citizens presenting budget results in an easy to understand format?\n    0 = No;    1 = Yes (basic info);    2 = Yes (comprehensive info/interactive)","0 … 2",2]
[10,"Q5.1","BC/CoA published?                                                                                  0 = No;    1 = Yes","0 / 1",1]
[11,"Q6.1","Approved annual budget published?                                              0 = No;    1 = Yes","0 / 1",1]
[12,"Q6.2","If Yes > Regularity of publication:                                                     0 = Not regular; \n    1 = Annual budget plans published regularly (within the last 5-year period)","0 / 1",1]
[13,"Q7.1","MTEF documents published?                                                              0 = No;    1 = Yes","0 / 1",1]
[14,"Q7.2","If Yes > Regularity of publication:                                                      0 = Not regular;\n    1 = MTEF plans published regularly (within the last 5-year period)","0 / 1",1]
[15,"Q8.1","Public investment plans?                                                                      0 = No;    1 = Yes","0 / 1",1]
[16,"Q8.2","If Yes > Regularity of publication:                                                      0 = Not regular; \n    1 = Investment plans published regularly (within the last 5-year period)","0 / 1",1]
[17,"Q9.1","Budget execution results?                                                                    0 = No;    1 = Yes","0 / 1",1]
[18,"Q9.3","If Yes > Regularity of publication:                                                      0 = Not regular;\n    1 = Budget exec results published regularly (within the last 5-year period)","0 / 1",1]
[19,"Q10.1","External audit of central gov budget operations?                      0 = No;    1 = Yes","0 / 1",1]
[20,"Q10.2","If Yes > Regularity of publication:                                                      0 = Not regular;\n    1 = Budget audits published regularly (within the last 5-year period)","0 / 1",1]
[21,"Q11.1","Consolidated results for key budget users?                                  0 = No;    1 = Yes","0 / 1"]
[22,"Q11.2","Sector analysis?                                                                                         0 = No;    1 = Yes","0 / 1"]
[23,"Q11.3","Regional analysis?                                                                                    0 = No;    1 = Yes","0 / 1"]
[24,"Q11.4","Gender analysis?                                                                                      0 = No;    1 = Yes","0 / 1"]
[25,"Q11.5","Spending for Children?                                                                          0 = No;    1 = Yes","0 / 1"]
[26,"Q11.6","Debt data?                                                                                                   0 = No;    1 = Yes","0 / 1"]
[27,"Q11.7","Foreign aid/grants?                                                                                 0 = No;    1 = Yes","0 / 1"]
[28,"Q11.8","Fiscal data on sub-national gov/municipalities?                         0 = No;    1 = Yes","0 / 1"]
[29,"Q11.9","Financial Statements?                                                                            0 = No;    1 = Yes","0 / 1"]
[30,"Q11.10","Public procurement and contracts?                                                  0 = No;    1 = Yes","0 / 1"]
[31,"Q12.1","Open Government/Open Budget web site?                                 0 = No;    1 = Yes","0 / 1"]
[32,"Q13.1","Does FMIS support the PFM needs of state/local governments or municipalities?                0 = No;    1 = Yes (only data collection/consolidation);\n    2 = Yes (support some of the SNG automation + data collection needs)","0 … 2"]
[33,"Q14.1","Is there a harmonized public accounting system for central + state/local governments and municipalities?                                                     0 = No;    1 = Yes","0 / 1"]
[34,"Q15.1","Is PF data published on the Statistics web site?    Or another web site?\n    0 = Statistics web site with no PF data;  \n    1 = Statistics web site publishing PF data;   \n    2 = Other web site publishing PF data (no Stats web site for PF data);  \n    3 = Both Statistics and other web sites publish PF data","0 … 3"]
[35,"Q16.1","Access to information explained?                                                     0 = No;    1 = Yes","0 / 1"]
[36,"Q17.1","Clarity of PFM roles and responsibilities on the web site:     0 = No;    1 = Yes","0 / 1"]
[37,"Q18.1","Compliance with specific int'l standards?                                     0 = National only;\n    1 = UN COFOG reports;    2 = IMF GFS reports (incl COFOG)","0 / 1"]
[38,"Q19.1","Web Statistics (e.g. visitors, freq visited web pages)?            0 = No;    1 = Yes","0 / 1"]
[39,"Q19.2","Platforms for feedback provision:                                                    0 = Not available;\n    1 = Email / Specific forms;       2 = Telephone/Fax/Mail;       3 = All","0 … 3"]
[40,"Q20.1","Native language?     Indicate native language code (ISO 639-2 Code alpha-3)","-"]

{"sheet":"INET Codes","index":5,"n_rows":247,"n_cols":2,"rows_kept":247,"cut":false,"hidden":true,"merged":[]}
["Economy","INET Code"]
["Andorra","AD"]
["United Arab Emirates","AE"]
["Afghanistan","AF"]
["Antigua and Barbuda","AG"]
["Anguilla","AI"]
["Albania","AL"]
["Armenia","AM"]
["Netherlands Antilles","AN"]
["Angola","AO"]
["Antarctica","AQ"]
["Argentina","AR"]
["American Samoa","AS"]
["Austria","AT"]
["Australia","AU"]
["Aruba","AW"]
["Azerbaijan","AZ"]
["Bosnia and Herzegovina","BA"]
["Barbados","BB"]
["Bangladesh","BD"]
["Belgium","BE"]
["Burkina Faso","BF"]
["Bulgaria","BG"]
["Bahrain","BH"]
["Burundi","BI"]
["Benin","BJ"]
["Bermuda","BM"]
["Brunei Darussalam","BN"]
["Bolivia","BO"]
["Brazil","BR"]
["Bahamas","BS"]
["Bhutan","BT"]
["Bouvet Island","BV"]
["Botswana","BW"]
["Belarus","BY"]
["Belize","BZ"]
["Canada","CA"]
["Cocos Islands","CC"]
["Central African Republic","CF"]
["Congo","CG"]
["Congo, Dem. Rep.","CD"]
["Switzerland","CH"]
["Cote D'Ivoire","CI"]
["Cook Islands","CK"]
["Chile","CL"]
["Cameroon","CM"]
["China","CN"]
["Colombia","CO"]
["Costa Rica","CR"]
["Czech Republic","CS"]
["Cuba","CU"]
["Cape Verde","CV"]
["Christmas Island","CX"]
["Cyprus","CY"]
["Czech Republic","CZ"]
["Germany","DE"]
["Djibouti","DJ"]
["Denmark","DK"]
["Dominica","DM"]
["Dominican Republic","DO"]
["Algeria","DZ"]
["Ecuador","EC"]
["Estonia","EE"]
["Egypt","EG"]
["Western Sahara","EH"]
["Eritrea","ER"]
["Spain","ES"]
["Ethiopia","ET"]
["Finland","FI"]
["Fiji","FJ"]
["Falkland Islands","FK"]
["Micronesia","FM"]
["Faroe Islands","FO"]
["France","FR"]
["France, Metropolitan","FX"]
["Gabon","GA"]
["Great Britain","GB"]
["Grenada","GD"]
["Georgia","GE"]
["French Guiana","GF"]
["Ghana","GH"]
["Gibraltar","GI"]
["Greenland","GL"]
["Gambia","GM"]
["Guinea","GN"]
["Guadeloupe","GP"]
["Equatorial Guinea","GQ"]
["Greece","GR"]
["S. Georgia and S. Sandwich Isls.","GS"]
["Guatemala","GT"]
["Guam","GU"]
["Guinea-Bissau","GW"]
["Guyana","GY"]
["Hong Kong","HK"]
["Heard and McDonald Islands","HM"]
["Honduras","HN"]
["Croatia","HR"]
["Haiti","HT"]
["Hungary","HU"]
["Indonesia","ID"]
["Ireland","IE"]
["Israel","IL"]
["India","IN"]
["British Indian Ocean Territory","IO"]
["Iraq","IQ"]
["Iran","IR"]
["Iceland","IS"]
["Italy","IT"]
["Jamaica","JM"]
["Jordan","JO"]
["Japan","JP"]
["Kenya","KE"]
["Kyrgyz Republic","KG"]
["Cambodia","KH"]
["Kiribati","KI"]
["Comoros","KM"]
["Saint Kitts and Nevis","KN"]
["Korea, Dem. Rep.","KP"]
["Korea, Rep.","KR"]
["Kuwait","KW"]
["Cayman Islands","KY"]
["Kazakhstan","KZ"]
["Laos","LA"]
["Lebanon","LB"]
["Saint Lucia","LC"]
["Liechtenstein","LI"]
["Sri Lanka","LK"]
["Liberia","LR"]
["Lesotho","LS"]
["Lithuania","LT"]
["Luxembourg","LU"]
["Latvia","LV"]
["Libya","LY"]
["Morocco","MA"]
["Monaco","MC"]
["Moldova","MD"]
["Madagascar","MG"]
["Marshall Islands","MH"]
["Macedonia","MK"]
["Mali","ML"]
["Myanmar","MM"]
["Mongolia","MN"]
["Macau","MO"]
["Northern Mariana Islands","MP"]
["Martinique","MQ"]
["Mauritania","MR"]
["Montserrat","MS"]
["Malta","MT"]
["Mauritius","MU"]
["Maldives","MV"]
["Malawi","MW"]
["Mexico","MX"]
["Malaysia","MY"]
["Mozambique","MZ"]
["Namibia","NA"]
["New Caledonia","NC"]
["Niger","NE"]
["Network","NE"]
["Norfolk Island","NF"]
["Nigeria","NG"]
["Nicaragua","NI"]
["Netherlands","NL"]
["Norway","NO"]
["Nepal","NP"]
["Nauru","NR"]
["Neutral Zone","NT"]
["Niue","NU"]
["New Zealand","NZ"]
["Oman","OM"]
["Panama","PA"]
["Peru","PE"]
["French Polynesia","PF"]
["Papua New Guinea","PG"]
["Philippines","PH"]
["Pakistan","PK"]
["Poland","PL"]
["St. Pierre and Miquelon","PM"]
["Pitcairn","PN"]
["Puerto Rico","PR"]
["Portugal","PT"]
["Palau","PW"]
["Paraguay","PY"]
["Qatar","QA"]
["Reunion","RE"]
["Romania","RO"]
["Russian Federation","RU"]
["Rwanda","RW"]
["Saudi Arabia","SA"]
["Solomon Islands","Sb"]
["Seychelles","SC"]
["Sudan","SD"]
["Sweden","SE"]
["Singapore","SG"]
["St. Helena","SH"]
["Slovenia","SI"]
["Svalbard and Jan Mayen Islands","SJ"]
["Slovak Republic","SK"]
["Sierra Leone","SL"]
["San Marino","SM"]
["Senegal","SN"]
["Serbia","RS"]
["Somalia","SO"]
["Suriname","SR"]
["São Tomé and Principe","ST"]
["USSR","SU"]
["El Salvador","SV"]
["Syria","SY"]
["Swaziland","SZ"]
["Turks and Caicos Islands","TC"]
["Chad","TD"]
["French Southern Territories","TF"]
["Togo","TG"]
["Thailand","TH"]
["Tajikistan","TJ"]
["Tokelau","TK"]
["Turkmenistan","TM"]
["Tunisia","TN"]
["Tonga","TO"]
["Timor-Leste","TP"]
["Turkey","TR"]
["Trinidad and Tobago","TT"]
["Tuvalu","TV"]
["Taiwan","TW"]
["Tanzania","TZ"]
["Ukraine","UA"]
["Uganda","UG"]
["United Kingdom","UK"]
["US Minor Outlying Islands","UM"]
["United States of America","US"]
["Uruguay","UY"]
["Uzbekistan","UZ"]
["Vatican City State","VA"]
["Saint Vincent and the Grenadines","VC"]
["Venezuela, RB","VE"]
["Virgin Islands (British)","VG"]
["Virgin Islands (U.S.)","VI"]
["Viet Nam","VN"]
["Vanuatu","VU"]
["Wallis and Futuna Islands","WF"]
["Samoa","WS"]
["Yemen","YE"]
["Mayotte","YT"]
["Yugoslavia","YU"]
["South Africa","ZA"]
["Zambia","ZM"]
["Zaire","ZR"]
["Zimbabwe","ZW"]

{"sheet":"Metadata","index":6,"n_rows":136,"n_cols":16,"rows_kept":136,"cut":false,"hidden":false,"merged":[]}
["#","Col","FMIS & BT Data Fields","Description","Type","Size","Format","Val #1","Value #1 Description","Val #2","Value #2 Description","Val #3","Value #3 Description","Val #4","Value #4 Description","Source"]
[1,"A","#","Sequence","int",3,"000","1 … 198","Sequence number of alphabetical listing",null,null,null,null,null,null,"Reviewers"]
[2,"B","Flag","Flag","image","-","png","-",null,null,null,null,null,null,null,"Wikipedia"]
[3,"C","Economy","Name of economy (linked to Wikipedia web site)","char",64,"URL","-",null,null,null,null,null,null,null,"Wikipedia"]
[4,"D","Level","Income level","char",4,"-","-","Standard codes: HIC / UMIC / LMIC / LIC",null,null,null,null,null,null,"WBG Open Data"]
[5,"E","Population","Population in thousands (2011)","int",9,"#,##0","-",null,null,null,null,null,null,null,"WBG Open Data"]
[6,"F","GNI","Gross National Income 2011, Atlas method (millions of USD)","int",9,"#,##0","-",null,null,null,null,null,null,null,"WBG Open Data"]
[7,"G","GNIPC","Gross National Income Per Capita 2011, Atlas method and PPP (USD)","int",7,"#,##0","-",null,null,null,null,null,null,null,"WBG Open Data"]
[8,"H","Q1.1  MoF URL","PF home page (web link to main PF home page)","char",256,"URL","-",null,null,null,null,null,null,null,"WWW"]
[9,"I","Q1.2  Org Name","Official Name of Finance Ministry / Department","char",256,"-","-",null,null,null,null,null,null,null,"WWW"]
[10,"J","Q1.3","Is there a dedicated PF publication web site? ","int",1,0,0,"No",1,"Yes (but, not clearly visible from home page)",2,"Yes (easy access to PF data from the home page)",null,null,"Reviewers"]
[11,"K","Q1.4  PF Data URL","If Yes to Q1.3 (1 or 2) > PF publication web link","char",256,"URL","-",null,null,null,null,null,null,null,"WWW"]
[12,"L","Q2.1","Is there a web site / doc on FMIS solution?","int",1,0,0,"No",1,"Yes (reference doc only)",2,"Yes (FMIS related web site)",null,null,"Reviewers"]
[13,"M","Q2.2 FMIS URL","If Yes to Q2.1 (1 or 2) > Related web link","char",256,"URL","-",null,null,null,null,null,null,null,"WWW"]
[14,"N","Q3.1","What is the source of Public Finance data?","int",1,0,0,"No published PF data",1,"Static (tables from unidentified sources)",2,"Dynamic (archived info/docs from systems)",3,"Dynamic (data/tables fm queries linked to FMIS DB/Data Warehouse)","Reviewers"]
[15,"O","Q3.2  Dynamic Q","If Dynamic (2 or 3) > Related web link","char",256,"URL","-",null,null,null,null,null,null,null,"WWW"]
[16,"P","Q3.3","Presence of Open Data (online, editable, free)","int",1,0,0,"No",1,"Yes",null,null,null,null,"Reviewers"]
[17,"Q","Q3.4  Open Data","If Yes to Open Data (1) > Related web link","char",256,"URL","-",null,null,null,null,null,null,null,"WWW"]
[18,"R","Q3.5","Is System Name visible in reports?","int",1,0,0,"No",1,"Yes",null,null,null,null,"Reviewers"]
[19,"S","Q3.6","Is System Time Stamp visible in reports?","int",1,0,0,"No",1,"Yes",null,null,null,null,"Reviewers"]
[20,"T","Q3.7  Reliability","If Yes to Q3.5 or Q3.6 (1) > Related web link","char",256,"URL","-",null,null,null,null,null,null,null,"WWW"]
[21,"U","Q4.1","What is the quality of PF data presentation?","int",1,0,0,"Below desired level (not informative)",1,"Partially acceptable (some of the tables are useful)",2,"Good quality (informative and easy to read)",null,null,"Reviewers"]
[22,"V","Q4.2","Content > Is there sufficient level of detail?","int",1,0,0,"No",1,"Yes",null,null,null,null,"Reviewers"]
[23,"W","Q4.3","Citizen's Budget (CB) > Is there a web site for citizens presenting budget results in a meaningful format?","int",1,0,0,"No",1,"Yes (basic info)",2,"Yes (comprehensive info/interactive)",null,null,"Reviewers"]
[24,"X","Q4.4  Ctz Budget","If Yes to Q4.3 (1 or 2) > Related web link","char",256,"URL","-",null,null,null,null,null,null,null,"WWW"]
[25,"Y","Q5.1","Is BC/CoA published?","int",1,0,0,"No",1,"Yes",null,null,null,null,"Reviewers"]
[26,"Z","Q5.2  BC/CoA","If Yes to Q5.1 (1) > Related web site/URL","char",256,"URL","-",null,null,null,null,null,null,null,"WWW"]
[27,"AA","Q6.1","Approved annual budget published?","int",1,0,0,"No",1,"Yes",null,null,null,null,"Reviewers"]
[28,"AB","Q6.2","If Yes to Q6.1 (1) > Regularity of publication","int",1,0,0,"Not regular",1,"Annual budget plans published regularly (within the last 5-year period)",null,null,null,null,"Reviewers"]
[29,"AC","Q6.3","Since > Starting year of published annual budget data (regular/irregular)","int",4,"YYYY","-",null,null,null,null,null,null,null,"WWW"]
[30,"AD","Q7.1","MTEF documents published?","int",1,0,0,"No",1,"Yes",null,null,null,null,"Reviewers"]
[31,"AE","Q7.2","If Yes to Q7.1 (1) > Regularity of publication","int",1,0,0,"Not regular",1,"MTEF plans published regularly (within the last 5-year period)",null,null,null,null,"Reviewers"]
[32,"AF","Q7.3","Period > Indicate the period (in years) of the MTEF (usually 3 yrs or more)","int",1,"Y","-",null,null,null,null,null,null,null,"Reviewers"]
[33,"AG","Q7.4","Since > Starting year of published MTEF data (regular/irregular)","int",4,"YYYY","-",null,null,null,null,null,null,null,"WWW"]
[34,"AH","Q8.1","Public investment plans?","int",1,0,0,"No",1,"Yes",null,null,null,null,"Reviewers"]
[35,"AI","Q8.2","If Yes to Q8.1 (1) > Regularity of publication","int",1,0,0,"Not regular",1,"Investment plans published regularly (within the last 5-year period)",null,null,null,null,"Reviewers"]
[36,"AJ","Q8.3","Since > Starting year of published investment plans (regular/irregular)","int",4,"YYYY","-",null,null,null,null,null,null,null,"WWW"]
[37,"AK","Q9.1","Budget execution results?","int",1,0,0,"No",1,"Yes",null,null,null,null,"Reviewers"]
[38,"AL","Q9.2","If Yes to Q9.1 (1) > Frequency of publication  (most frequently published)","int",1,0,1,"Weekly",2,"Monthly",3,"Quarterly",4,"Annually","WWW"]
[39,"AM","Q9.3","If Yes to Q9.1 (1) > Regularity of publication","int",1,0,0,"Not regular",1,"Budget exec results published regularly (within the last 5-year period)",null,null,null,null,"Reviewers"]
[40,"AN","Q9.4","Since > Starting year of published execution results (regular/irregular)","int",4,"YYYY","-",null,null,null,null,null,null,null,"WWW"]
[41,"AO","Q10.1","External audit of central gov budget operations?","int",1,0,0,"No",1,"Yes",null,null,null,null,"Reviewers"]
[42,"AP","Q10.2","If Yes to Q10.1 (1) > Regularity of publication","int",1,0,0,"Not regular",1,"Budget audits published regularly (within the last 5-year period)",null,null,null,null,"Reviewers"]
[43,"AQ","Q10.3","Since > Starting year of published budget audits (regular/irregular)","int",4,"YYYY","-",null,null,null,null,null,null,null,"WWW"]
[44,"AR","Q11.1","Consolidated results for key budget users?","int",1,0,0,"No",1,"Yes",null,null,null,null,"Reviewers"]
[45,"AS","Q11.2","Sector analysis?","int",1,0,0,"No",1,"Yes",null,null,null,null,"Reviewers"]
[46,"AT","Q11.3","Regional analysis?","int",1,0,0,"No",1,"Yes",null,null,null,null,"Reviewers"]
[47,"AU","Q11.4","Gender analysis?","int",1,0,0,"No",1,"Yes",null,null,null,null,"Reviewers"]
[48,"AV","Q11.5","Analysis of spending for Children and Youth?","int",1,0,0,"No",1,"Yes",null,null,null,null,"Reviewers"]
[49,"AW","Q11.6","Debt data?","int",1,0,0,"No",1,"Yes",null,null,null,null,"Reviewers"]
[50,"AX","Q11.7","Foreign aid/grants?","int",1,0,0,"No",1,"Yes",null,null,null,null,"Reviewers"]
[51,"AY","Q11.8","Fiscal data on sub-national gov/municipalities?","int",1,0,0,"No",1,"Yes",null,null,null,null,"Reviewers"]
[52,"AZ","Q11.9","Financial Statements?","int",1,0,0,"No",1,"Yes",null,null,null,null,"Reviewers"]
[53,"BA","Q11.10","Public procurement and contracts?","int",1,0,0,"No",1,"Yes",null,null,null,null,"Reviewers"]
[54,"BB","Q11.11","Other PF Data?","int",1,0,0,"No",1,"Yes",null,null,null,null,"Reviewers"]
[55,"BC","Q11.12  Other","If Yes to Q11.11 (1) > Related web link","char",256,"URL","-",null,null,null,null,null,null,null,"WWW"]
[56,"BD","Q12.1","Open Government/Open Data web site?","int",1,0,0,"No",1,"Yes",null,null,null,null,"Reviewers"]
[57,"BE","Q12.2  Open Gov","If Yes to Q12.1 (1) > Related web link","char",256,"URL","-",null,null,null,null,null,null,null,"WWW"]
[58,"BF","Q13.1","Does FMIS support the PFM needs of state/local governments or municipalities?",null,null,null,0,"No",1,"Yes (only data collection/consolidation)",2,"Yes (support some of the SNG automation + data collection needs)",null,null,"Reviewers"]
[59,"BG","Q13.2  FMIS SNG","If Yes to Q13.1 (1 or 2) > Related web site","char",256,"URL","-",null,null,null,null,null,null,null,"WWW"]
[60,"BH","Q14.1","Is there a harmonized public accounting system for central + state/local governments and municipalities?","int",1,0,0,"No",1,"Yes",null,null,null,null,"Reviewers"]
[61,"BI","Q14.2  Acct SNG","If Yes to Q14.1 (1) > Related web link","char",256,"URL","-",null,null,null,null,null,null,null,"WWW"]
[62,"BJ","Q15.1","Is PF data published on the Statistics web site?    Or another web site?","int",1,0,0,"Statistics web site with no PF data",1,"Statistics web site publishing PF data",2,"Other web site publishing PF data (no Stats web site for PF data)",3,"Both Statistics and other web sites publish PF data","Reviewers"]
[63,"BK","Q15.2  Stats URL","If Q15.1 = 0 or 1 > URL of the Statistics Org web site","char",256,"URL","-",null,null,null,null,null,null,null,"WWW"]
[64,"BL","Q15.3  Stats Org","Official Name of Statistical Organization","char",256,"-","-",null,null,null,null,null,null,null,"WWW"]
[65,"BM","Q15.4  CB URL","URL of the Central Bank","char",256,"URL","-",null,null,null,null,null,null,null,"WWW"]
[66,"BN","Q15.5  Cent Bank","Official Name of Central Bank","char",256,"-","-",null,null,null,null,null,null,null,"WWW"]
[67,"BO","Q15.6  Other URL","If Q15.1 = 2 or 3 > URL of other major alternative PF publication web site","char",256,"URL","-",null,null,null,null,null,null,null,"WWW"]
[68,"BP","Q16.1","Access to information explained?                                                     0 = No;    1 = Yes","int",1,0,0,"No",1,"Yes",null,null,null,null,"Reviewers"]
[69,"BQ","Q16.2  ATI","If Yes to Q16.1 (1) > Related web site","char",256,"URL","-",null,null,null,null,null,null,null,"WWW"]
[70,"BR","Q17.1","Clarity of PFM roles and responsibilities on the web site?    0 = No;    1 = Yes","int",1,0,0,"No",1,"Yes",null,null,null,null,"Reviewers"]
[71,"BS","Q17.2  PFM Reg","If Yes to Q17.1 (1) > Related web site","char",256,"URL","-",null,null,null,null,null,null,null,"WWW"]
[72,"BT","Q18.1","Compliance with specific int'l standards?","int",1,0,0,"National only",1,"UN COFOG reports",2,"IMF GFS reports (incl COFOG)",null,null,"Reviewers"]
[73,"BU","Q18.2  Other Rep","If Other > Please describe reporting formats","char",64,"-","-",null,null,null,null,null,null,null,"Reviewers"]
[74,"BV","Q19.1","Web Statistics (e.g. visitors, freq visited web pages)?             0 = No;    1 = Yes","int",1,0,0,"No",1,"Yes",null,null,null,null,"Reviewers"]
[75,"BW","Q19.2","Which platforms are available for feedback provision?","int",1,0,0,"Not available",1,"Email / Specific forms",2,"Telephone/Fax/Mail",3,"All","Reviewers"]
[76,"BX","Q19.3  Feedback","If Other > Please describe other feedback mechanism in a few words","char",64,"-","-",null,null,null,null,null,null,null,"Reviewers"]
[77,"BY","Q20.1","Native language?  Indicate native language code (ISO 639-2 Code alpha-3)","char",3,"xxx","-",null,null,null,null,null,null,null,"WWW"]
[78,"BZ","Q20.2","Language #1 option?  Indicate other language #1 code","char",3,"xxx","-",null,null,null,null,null,null,null,"WWW"]
[79,"CA","Q20.3","Language #2 option?  Indicate other language #2 code","char",3,"xxx","-",null,null,null,null,null,null,null,"WWW"]
[80,"CB","Q20.4","Language #3 option?  Indicate other language #3 code","char",3,"xxx","-",null,null,null,null,null,null,null,"WWW"]
[81,"CC","Q20.5","Change of contents for PF data in different languages:","int",1,0,0,"Less detail",1,"Same level of detail in different languages",null,null,null,null,"Reviewers"]
[82,"CD","FMIS / TS","Abbreviation of the FMIS solution","char",64,"-",null,null,null,null,null,null,null,null,"WWW"]
[83,"CE","FMIS","Full name of the FMIS solution","char",256,"-",null,null,null,null,null,null,null,null,"WWW"]
[84,"CF","Tpl","PFM topology","char",1,"X","C","Centralized PFM operations","D","Decentralized PFM operations",null,null,null,null,"Reviewers, WWW"]
[85,"CG","Func","FMIS functional scope","char",1,"X","B","Budget Planning/Formulation (MTF, prog based budg, perf based budg)","T","Treasury (PEM)","F","FMIS (F=T+B; in some cases +O)","O","Other FMIS components (perf mgmt, HR, payroll)","Reviewers, WWW"]
[86,"CH","Status","Status of T/F implementation","int",1,0,1,"T/F impl as a new system",2,"Expansion of existing T/F",3,"New T/F impl during the emergency TA",4,"Expansion of existing T/F impl via emergency TA","Reviewers, WWW"]
[87,"CI","Op Yr","Year in which the TS/FMIS became operational","char",4,"YYYY","-",null,null,null,null,null,null,null,"WWW"]
[88,"CJ","Scope","Scope of T/F impl (coverage of budgets)","char",3,"XXX","C","Only central government","L","Local gov entities (districts)","C+L","Both central and district level",null,null,"Reviewers, WWW"]
[89,"CK","Type","Type of T/F solution developed","int",1,0,1,"T/F impl as a new system",2,"Expansion of existing T/F",3,"New T/F impl during the emergency TA",4,"Expansion of existing T/F impl via emergency TA","Reviewers, WWW"]
[90,"CL","ASW","Type of Application Software solution","int",1,0,0,"Not identified yet",1,"Locally Developed Software (LDSW)",2,"Customized Commercial off-the-shelf Software (COTS)",null,null,"Reviewers, WWW"]
[91,"CM","ASW Solution","Name of T/F Application Software (ASW) solution","char",64,"-","COTS","Name of ASW package","LDSW","Name of Database used in developing ASW",null,null,null,null,"Reviewers, WWW"]
[92,"CN","Arch","Type of T/F Application Software (ASW)","char",3,"-","CS","(Client-Server) distributed system/decentralized operations","Web","(Web-Based) centralized system/decentralized operations",null,null,null,null,"Reviewers, WWW"]
[93,"CO","PEFA Yr","Completion date (year) of the latest PEFA assessment (as of Oct 2012)","char",4,"YYYY","-",null,null,null,null,null,null,null,"www.pefa.org"]
[94,"CP","Stat","Disclosure status (as of Oct 2012):","char",6,"-","Public","Publicly available","Final","Completed, but not publicly disclosed","Draft","Draft report completed, Disclosure status unknown.",null,null,"www.pefa.org"]
[95,"CQ","PI-5","PI-5  Classification of the budget","char",1,"X","-",null,null,null,null,null,null,null,"www.pefa.org"]
[96,"CR","PI-6","PI-6  Comprehensiveness of information included in budget documentation","char",1,"X","-",null,null,null,null,null,null,null,"www.pefa.org"]
[97,"CS","PI-10","PI-10  Public access to key fiscal information","char",1,"X","-",null,null,null,null,null,null,null,"www.pefa.org"]
[98,"CT","PI-12","PI-12  Multi-year perspective in fiscal planning, expenditure policy and budgeting","char",1,"X","-",null,null,null,null,null,null,null,"www.pefa.org"]
[99,"CU","PI-22","PI-22  Timeliness and regularity of accounts reconciliation","char",1,"X","-",null,null,null,null,null,null,null,"www.pefa.org"]
[100,"CV","PI-23","PI-23  Availability of information on resources received by service delivery units","char",1,"X","-",null,null,null,null,null,null,null,"www.pefa.org"]
[101,"CW","PI-24","PI-24  Quality and timeliness of in-year budget reports","char",1,"X","-",null,null,null,null,null,null,null,"www.pefa.org"]
[102,"CX","PI-25","PI-25  Quality and timeliness of annual financial statements","char",1,"X","-",null,null,null,null,null,null,null,"www.pefa.org"]
[103,"CY","PI-26","PI-26  Scope, nature and follow-up of external audit","char",1,"X","-",null,null,null,null,null,null,null,"www.pefa.org"]
[104,"CZ","D-2","D-2  Financial information provided by donors for budgeting and reporting on project and program aid","char",1,"X","-",null,null,null,null,null,null,null,"www.pefa.org"]
[105,"DA","Avg10","Average of 10 PEFA indicators selected for a comparison with the FMIS & BT scores.","float",4.2,"0.00","-",null,null,null,null,null,null,null,"www.pefa.org"]
[106,"DB","Avg","Average of all 31 PEFA indicators. NR/NA/NU scores are excluded in avg calculations.","float",4.2,"0.00","-",null,null,null,null,null,null,null,"www.pefa.org"]
[108,"DC","OBI_12","2012 Open Budget Index (0 … 100) ","int",3,"000","-",null,null,null,null,null,null,null,"OBS"]
[109,"DD","OBI_10","2010 Open Budget Index (0 … 100)","int",3,"000","-",null,null,null,null,null,null,null,"OBS"]
[107,"DE","OGP","Status of participation in the Open Government Partnership initiative","int",1,0,0,"No",1,"Yes",null,null,null,null,"OGP"]
[111,"DF","MTEF","Status of Medium-Term Expenditure Framework (MTEF) implementation (as of 2010)","int",1,0,0,"No MTEF",1,"MTFF (Medium-Term Fiscal Framework)",2,"MTBF (Medium-Term Budget Framework)",3,"MTPF (Medium-Term Performance Framework)","WBG / PRMPS"]
[110,"DG","eGov12","UN e-Government 2012 ranking (1 … 190)","int",3,"000","-",null,null,null,null,null,null,null,"UNPAN"]
[121,"DH","eGov","UN e-Government 2012 index","float",4.2,"0.00","-",null,null,null,null,null,null,null,"UNPAN"]
[122,"DI","eOS","UN e-Government 2012 index - Online Services","float",4.2,"0.00","-",null,null,null,null,null,null,null,"UNPAN"]
[123,"DJ","eTC","UN e-Government 2012 index - Telco infrastructure","float",4.2,"0.00","-",null,null,null,null,null,null,null,"UNPAN"]
[124,"DK","eHC","UN e-Government 2012 index - Human cap dev","float",4.2,"0.00","-",null,null,null,null,null,null,null,"UNPAN"]
[116,"DL","Region","Mapping to the World Bank regions (abbreviation)","char",3,"XXX","-","AFR / EAP / ECA / LCR / MNA / SAR",null,null,null,null,null,null,"WBG Open Data"]
[117,"DM","Zone","Zone of various countries according to their membership in int'l organizations","char",3,"XXX","-","EU / EUR / AME / PAC / OTH",null,null,null,null,null,null,"WWW"]
[118,"DN","OECD","OECD membership ","char",4,"XXXX","OECD",null,null,null,null,null,null,null,"WWW"]
[119,"DO","APEC","APEC membership","char",4,"XXXX","APEC",null,null,null,null,null,null,null,"WWW"]
[120,"DP","Fragile","Fragile state status","char",1,"X","F",null,null,null,null,null,null,null,"WBG Open Data"]
[125,"DQ","Economies","Name of economy ","char",64,"-","-",null,null,null,null,null,null,null,"WWW"]
[126,"DR","OSS Gov","National Open Source Policies (in 66 economies)","int",3,"000","-",null,null,null,null,null,null,null,"CSIS"]
[127,"DS","R","OS Gov policies - Research & Development","int",2,"00","-",null,null,null,null,null,null,null,"CSIS"]
[128,"DT","A","OS Gov policies - Advisory","int",2,"00","-",null,null,null,null,null,null,null,"CSIS"]
[129,"DU","P","OS Gov policies - Proposed","int",2,"00","-",null,null,null,null,null,null,null,"CSIS"]
[130,"DV","M","OS Gov policies - Mandatory","int",2,"00","-",null,null,null,null,null,null,null,"CSIS"]
[131,"DW","OSS Loc","States / Provinces / Cities Open Source Policies (in 22 economies)","int",3,"000","-",null,null,null,null,null,null,null,"CSIS"]
[132,"DX","R","OS Gov policies - Research & Development","int",2,"00","-",null,null,null,null,null,null,null,"CSIS"]
[133,"DY","A","OS Gov policies - Advisory","int",2,"00","-",null,null,null,null,null,null,null,"CSIS"]
[134,"DZ","P","OS Gov policies - Proposed","int",2,"00","-",null,null,null,null,null,null,null,"CSIS"]
[135,"EA","M","OS Gov policies - Mandatory","int",2,"00","-",null,null,null,null,null,null,null,"CSIS"]
[136,"EB","Verif date","Date of verification by relevant gov officials","date",9,"dd-mmm-yy",null,null,null,null,null,null,null,null,"Reviewers"]
[112,"EC","Tot Pts","Total points for 20 key indicators","float",6.2,"000.00","-",null,null,null,null,null,null,null,"Calculated"]
[113,"ED","Score","Normalized FMIS & OBD score","float",6.2,"000.00","-",null,null,null,null,null,null,null,"Calculated"]
[114,"EE","Group","FMIS & OBD practice group (A to D)","char",1,"X","A","Highly visible","B","Visible","C","Limited visibility","D","Minimal visibility","Calculated"]